{"text_format":"2","workbook":"xlsx","n_sheets":9,"sheets":["0.출연(연) 등 평가지표 및 배점","(참고)배점 세부내역","1.연구지원 조직역량강화노력","2.연구지원 인력의 운영수준","3.규정개선 및 실행현황","4.기관연구지원 시스템구축 및 운영","5. 연구윤리관리의 적절성","6.국가R&D연구개발비 사용기준 준수여부","7.연구지원 서비스만족도 및 우수사례"],"not_rendered":{"charts":0,"images":3,"macros":0,"external_links":0,"defined_names":9,"comments":4,"pivot_tables":0},"unopened":[],"bounds":{"document_bytes":16777216,"sheet_cells":100000,"run_cost":"one","rows_first":2000,"rows_last":500,"rows_between":2000,"halvings":0,"cell_chars":16384,"cell_head_chars":4096},"cells_cut":0,"cells_raw":0,"read":"whole","date_system":"1900"}

{"sheet":"0.출연(연) 등 평가지표 및 배점","index":0,"n_rows":38,"n_cols":14,"rows_kept":38,"cut":false,"hidden":false,"merged":[[32,2,32,3],[33,2,34,2],[35,2,35,3],[17,2,21,2],[22,2,22,3],[29,2,29,3],[37,1,37,3],[9,1,16,1],[17,1,22,1],[36,1,36,3],[9,2,12,2],[13,2,15,2],[16,2,16,3],[33,1,35,1],[30,1,32,1],[23,1,29,1],[23,2,26,2],[27,2,28,2],[30,2,31,2]]}
[]
[null,"0.출연(연) 등 평가지표 및 배점"]
[]
[null,"기관명","OOO"]
[null,"기관 유형","출연연","(출연연/특정연/전문연/4대과기원/기타비영리연구기관 중에서 선택)",{"$nulls":5},1,"F",null,null,"출연연"]
[null,"자체평가 점수",{"$f":"G38","v":69},{"$nulls":6},70,"E",null,null,"특정연"]
[null,"자체평가 등급",{"$f":"VLOOKUP(C6,$J$5:$K$11,2,1)","v":"F"},{"$nulls":6},75,"D",null,null,"특정연(4대과기원)"]
[{"$nulls":9},80,"C",null,null,"전문연"]
[null,"구분","평가지표","세부지표","번호","배점","자체평가","해당여부",null,85,"B",null,null,"기타비영리연구기관"]
[null,"Ⅰ. 연구지원조직의 \n운영역량","1. 연구지원 조직역량강화노력(16)","① 전담조직 내 연구지원 별도기능 설치","1-1",3,{"$f":"SUM('1.연구지원 조직역량강화노력'!N24:O24)","v":3},"O",null,90,"A"]
[null,null,null,"② 연구지원 전담조직의 연구장비･재료(시약포함) 전담검수인력 확보","1-2",3,{"$f":"SUM('1.연구지원 조직역량강화노력'!N46:P46)","v":3},"O",null,95,"S"]
[null,null,null,"③ 연구지원인력에 대한 교육실적","1-3",5,{"$f":"SUM('1.연구지원 조직역량강화노력'!N170:P170)","v":3},"O"]
[null,null,null,"④ 연구자에 대한 교육실적","1-4",5,{"$f":"SUM('1.연구지원 조직역량강화노력'!N292:P292)","v":4},"O"]
[null,null,"2. 연구지원 인력의 운영수준(11)","① 연구지원인력의 확보","2-1",4,{"$f":"SUM('2.연구지원 인력의 운영수준'!Q27:R27)","v":3},"O"]
[null,null,null,"② 연구비 10억당 연구지원 인력","2-2",4,{"$f":"SUM('2.연구지원 인력의 운영수준'!Q66:R66)","v":2},"O"]
[null,null,null,"③ 연구지원 인력의 정규직 비중","2-3",3,{"$f":"SUM('2.연구지원 인력의 운영수준'!Q116:R116)","v":3},"O",null,"O"]
[null,null,"소 계",null,null,{"$f":"SUM(F10:F16)","v":27},{"$f":"SUM(G10:G16)","v":21},"-",null,"해당없음"]
[null,"Ⅱ. 연구자 처우개선을 위한 규제 개선","3. 규정 개선 및 실행 현황(17)","① 국내 출장운임 관련 내부규정 및 정액지급 여부","3-1",{"$f":"IF(H18=\"해당없음\",0,3)","v":3},{"$f":"IF(H18=\"해당없음\",0,SUM('3.규정개선 및 실행현황'!K39:L39))","v":3},{"$f":"IF(C5=\"출연연\",\"O\",\"해당없음\")","v":"O"},"(주의) 출연연을 제외한 특정연 및 전문연은 자동으로 \"해당없음\" 선택됨"]
[null,null,null,"② 회의비 집행 증명 간소화 규정 및 현황","3-2",4,{"$f":"SUM('3.규정개선 및 실행현황'!K76:L76)","v":2},"O"]
[null,null,null,"③ 연구근접지원인력 필요경비 비용집행 규정 및 현황","3-3",{"$f":"IF(H20=\"해당없음\",0,3)","v":3},{"$f":"IF(H20=\"해당없음\",0,SUM('3.규정개선 및 실행현황'!K112:L112))","v":2},{"$f":"IF('3.규정개선 및 실행현황'!D86=\"X\",\"해당없음\",\"O\")","v":"O"},"(주의) 3-3에서 연구근접지원인력 해당이 없는 경우 자동으로 \"해당없음\" 선택됨"]
[null,null,null,"④ 논문게재료 집행유연성 규정 및 현황","3-4",3,{"$f":"SUM('3.규정개선 및 실행현황'!K146:L146)","v":2},"O"]
[null,null,null,"⑤ 학생연수자 근로계약 및 직무발명보상금 지급 여부","3-5",{"$f":"IF(H22=\"해당없음\",0,4)","v":4},{"$f":"IF(H22=\"해당없음\",0,SUM('3.규정개선 및 실행현황'!K191:L191))","v":3},{"$f":"IF('3.규정개선 및 실행현황'!D156=\"X\",\"해당없음\",\"O\")","v":"O"},"(주의) 학생연수자가 없는 경우에는 자동으로 \"해당없음\" 선택됨"]
[null,null,"소 계",null,null,{"$f":"SUM(F18:F22)","v":17},{"$f":"SUM(G18:G22)","v":12},"-"]
[null,"Ⅲ. 연구비 집행의 \n투명성","4. 기관연구지원 시스템 구축 및 운영(15)","① 독립적 기관연구지원시스템 구축･운영","4-1",4,{"$f":"SUM('4.기관연구지원 시스템구축 및 운영'!K29:L29)","v":2},"O"]
[null,null,null,"② 기관연구지원시스템 전산화 운영수준 및 범위","4-2",5,{"$f":"SUM('4.기관연구지원 시스템구축 및 운영'!K66:L66)","v":4},"O"]
[null,null,null,"③ 기관연구지원시스템 유지･보수 운영수준","4-3",3,{"$f":"SUM('4.기관연구지원 시스템구축 및 운영'!K84:L84)","v":1},"O"]
[null,null,null,"④ 연구비통합관리시스템의 연동성","4-4",3,{"$f":"SUM('4.기관연구지원 시스템구축 및 운영'!K106:L106)","v":3},"O"]
[null,null,"5. 연구윤리 관리의 적절성\n(-6 ~ +2)","① 제재 통보 건수 및 연구비환수 금액","5-1","(-2~+2)",{"$f":"SUM('5. 연구윤리관리의 적절성'!L33:M33)","v":-1},"O"]
[null,null,null,"② 연구윤리 확립 노력 ","5-2","(-4)",{"$f":"SUM('5. 연구윤리관리의 적절성'!L62:M62)","v":-4},"O"]
[null,null,"소 계",null,null,"15(-4)",{"$f":"SUM(G24:G29)","v":5},"-"]
[null,"Ⅳ. 연구제도 운영의 \n합리성","6. 국가연구개발사업 연구개발비 사용 기준 준수 여부(25(+3))","① 직접비 관리의 적절성","6-1","18(+1)",{"$f":"SUM('6.국가R&D연구개발비 사용기준 준수여부'!K186:L186)","v":10},"O"]
[null,null,null,"② 간접비 관리의 적절성","6-2","7(+2)",{"$f":"SUM('6.국가R&D연구개발비 사용기준 준수여부'!K305:L305)","v":6},"O"]
[null,null,"소 계",null,null,"25(+3)",{"$f":"SUM(G31:G32)","v":16},"-"]
[null,"Ⅴ. 연구자 애로사항 \n모니터링","7. 연구지원 서비스 만족도 및 \n우수사례(16)","① 연구지원 서비스 만족도 조사","7-1",10,{"$f":"SUM('7.연구지원 서비스만족도 및 우수사례'!K27:L27)","v":9},"O"]
[null,null,null,"② 연구지원을 위한 상시적인 모니터링에 따른 조치 우수사례","7-2",6,{"$f":"SUM('7.연구지원 서비스만족도 및 우수사례'!K57:L57)","v":6},"O"]
[null,null,"소 계",null,null,16,{"$f":"SUM(G34:G35)","v":15},"-"]
[null,"단순 점수 합계",null,null,null,{"$f":"SUM($F$17,$F$23,15,25,$F$36)","v":100},{"$f":"SUM($G$17,$G$23,$G$30,$G$33,$G$36)","v":69},"-"]
[null,"변환 점수 합계\n(해당사항 없는 평가항목이 존재하는 경우 100점 만점으로 환산)",null,null,null,100,{"$f":"ROUND(G37/F37*100,2)","v":69},"-"]

{"sheet":"(참고)배점 세부내역","index":1,"n_rows":57,"n_cols":13,"rows_kept":57,"cut":false,"hidden":false,"merged":[[45,4,50,4],[45,5,50,5],[29,4,30,4],[29,5,30,5],[33,3,34,3],[33,4,34,4],[33,5,34,5],[37,3,44,3],[37,4,44,4],[37,5,44,5],[29,3,30,3],[23,4,24,4],[23,5,24,5],[17,2,26,2],[25,3,26,3],[25,4,26,4],[25,5,26,5],[17,4,18,4],[17,5,18,5],[19,3,20,3],[19,4,20,4],[19,5,20,5],[21,3,22,3],[21,4,22,4],[21,5,22,5],[17,3,18,3],[23,3,24,3],[9,4,10,4],[9,5,10,5],[7,2,12,2],[11,3,12,3],[11,4,12,4],[11,5,12,5],[9,3,10,3],[52,1,54,1],[52,2,53,2],[54,2,54,3],[55,1,55,3],[56,1,56,3],[37,2,50,2],[28,1,36,1],[28,2,32,2],[33,2,35,2],[36,2,36,3],[37,1,51,1],[51,2,51,3],[45,3,50,3],[7,1,16,1],[13,2,15,2],[16,2,16,3],[17,1,27,1],[27,2,27,3]]}
[]
[null,"(참고) 출연(연) 등 평가지표 및 배점 세부내역"]
[]
[null,"기관명",{"$f":"'0.출연(연) 등 평가지표 및 배점'!C4","v":"OOO"}]
[null,"기관 유형",{"$f":"'0.출연(연) 등 평가지표 및 배점'!C5","v":"출연연"}]
[]
[null,"구분","평가지표","세부지표","번호","배점","세세부지표","세부배점","자체평가","해당여부","검증"]
[null,"Ⅰ. 연구지원조직의 \n운영역량","1. 연구지원 조직역량강화노력(16)","① 전담조직 내 연구지원 별도기능 설치","1-1",3,null,3,{"$f":"SUM('1.연구지원 조직역량강화노력'!N24:O24)","v":3},"O",null,null,"O"]
[null,null,null,"② 연구지원 전담조직의 연구장비･재료(시약포함) 전담검수인력 확보","1-2",3,null,3,{"$f":"SUM('1.연구지원 조직역량강화노력'!N46:P46)","v":3},"O",null,null,"해당없음"]
[null,null,null,"③ 연구지원인력에 대한 교육실적","1-3",5,"1) 연구지원인력에 대한 교육실적 ",3,{"$f":"SUM('1.연구지원 조직역량강화노력'!N168:P168)","v":1},"O"]
[{"$nulls":6},"2) 연구지원인력 우수 교육사례",2,{"$f":"SUM('1.연구지원 조직역량강화노력'!N169:P169)","v":2},"O"]
[null,null,null,"④ 연구자에 대한 교육실적","1-4",5,"1) 연구자에 대한 교육실적",3,{"$f":"SUM('1.연구지원 조직역량강화노력'!N290:P290)","v":2},"O"]
[{"$nulls":6},"2) 연구자 우수 교육사례",2,{"$f":"SUM('1.연구지원 조직역량강화노력'!N291:P291)","v":2},"O"]
[null,null,"2. 연구지원 인력의 운영수준(11)","① 연구지원인력의 확보","2-1",4,null,4,{"$f":"SUM('2.연구지원 인력의 운영수준'!Q27:R27)","v":3},"O"]
[null,null,null,"② 연구비 10억당 연구지원 인력","2-2",4,null,4,{"$f":"SUM('2.연구지원 인력의 운영수준'!Q66:R66)","v":2},"O"]
[null,null,null,"③ 연구지원 인력의 정규직 비중","2-3",3,null,3,{"$f":"SUM('2.연구지원 인력의 운영수준'!Q116:R116)","v":3},"O"]
[null,null,"소 계",null,null,{"$f":"SUM(F8:F16)","v":27},null,{"$f":"SUM(H8:H16)","v":27},{"$f":"SUM(I8:I16)","v":21},"-",{"$f":"I17-'0.출연(연) 등 평가지표 및 배점'!G17","v":0}]
[null,"Ⅱ. 연구자 처우개선을 위한 규제 개선","3. 규정 개선 및 실행 현황(17)","① 국내 출장운임 관련 내부규정 및 정액지급 여부","3-1",{"$f":"IF(J18=\"해당없음\",0,3)","v":3},"1) 국내 출장운임 정액 지급 내부규정",{"$f":"IF(J18=\"해당없음\",0,2)","v":2},{"$f":"SUM('3.규정개선 및 실행현황'!K37:L37)","v":1},{"$f":"IF(C5=\"출연연\",\"O\",\"해당없음\")","v":"O"}]
[{"$nulls":6},"2) 국내 출장운임 정액지급 여부",{"$f":"IF(J19=\"해당없음\",0,1)","v":1},{"$f":"SUM('3.규정개선 및 실행현황'!K38:L38)","v":2},{"$f":"IF(C5=\"출연연\",\"O\",\"해당없음\")","v":"O"}]
[null,null,null,"② 회의비 집행 증명 간소화 규정 및 현황","3-2",4,"1) 회의비 집행 증명 간소화 규정",3,{"$f":"SUM('3.규정개선 및 실행현황'!K74:L74)","v":1},"O"]
[{"$nulls":6},"2) 회의비 집행 증명 간소화 현황",1,{"$f":"SUM('3.규정개선 및 실행현황'!K75:L75)","v":1},"O"]
[null,null,null,"③ 연구근접지원인력 필요경비 비용집행 규정 및 현황","3-3",{"$f":"IF(J22=\"해당없음\",0,3)","v":3},"1) 직접연구지원인력 중 연구근접지원인력 회의비 및 출장비 비용집행 규정",{"$f":"IF(J22=\"해당없음\",0,2)","v":2},{"$f":"SUM('3.규정개선 및 실행현황'!K110:L110)","v":1},{"$f":"IF('3.규정개선 및 실행현황'!D86=\"X\",\"해당없음\",\"O\")","v":"O"}]
[{"$nulls":6},"2) 연구근접지원인력 비용집행실적",{"$f":"IF(J23=\"해당없음\",0,1)","v":1},{"$f":"SUM('3.규정개선 및 실행현황'!K111:L111)","v":1},{"$f":"IF('3.규정개선 및 실행현황'!D86=\"X\",\"해당없음\",\"O\")","v":"O"}]
[null,null,null,"④ 논문게재료 집행유연성 규정 및 현황","3-4",3,"1) 논문게재료 집행유연성 규정",2,{"$f":"SUM('3.규정개선 및 실행현황'!K144:L144)","v":1},"O"]
[{"$nulls":6},"2) 논문게재료 집행유연성 실적",1,{"$f":"SUM('3.규정개선 및 실행현황'!K145:L145)","v":1},"O"]
[null,null,null,"⑤ 학생연수자 근로계약 및 직무발명보상금 지급 여부","3-5",4,"1) 학생연수자 근로계약 여부",{"$f":"IF(J26=\"해당없음\",0,2)","v":2},{"$f":"SUM('3.규정개선 및 실행현황'!K189:L189)","v":1},{"$f":"IF('3.규정개선 및 실행현황'!D156=\"X\",\"해당없음\",\"O\")","v":"O"}]
[{"$nulls":6},"2) 학생연수자 직무발명보상금 지급 여부",{"$f":"IF(J27=\"해당없음\",0,2)","v":2},{"$f":"SUM('3.규정개선 및 실행현황'!K190:L190)","v":2},{"$f":"IF('3.규정개선 및 실행현황'!D156=\"X\",\"해당없음\",\"O\")","v":"O"}]
[null,null,"소 계",null,null,{"$f":"SUM(F18:F27)","v":17},null,{"$f":"SUM(H18:H27)","v":17},{"$f":"SUM(I18:I27)","v":12},"-",{"$f":"I28-'0.출연(연) 등 평가지표 및 배점'!G23","v":0}]
[null,"Ⅲ. 연구비 집행의 \n투명성","4. 기관연구지원 시스템 구축 및 운영(15)","① 독립적 기관연구지원시스템 구축･운영","4-1",4,null,4,{"$f":"SUM('4.기관연구지원 시스템구축 및 운영'!K29:L29)","v":2},"O"]
[null,null,null,"② 기관연구지원시스템 전산화 운영수준 및 범위","4-2",5,"1) 기관연구지원시스템 전산화 운영수준",3,{"$f":"SUM('4.기관연구지원 시스템구축 및 운영'!K64:L64)","v":2},"O"]
[{"$nulls":6},"2) 기관연구지원시스템 전산화 범위",2,{"$f":"SUM('4.기관연구지원 시스템구축 및 운영'!K65:L65)","v":2},"O"]
[null,null,null,"③ 기관연구지원시스템 유지･보수 운영수준","4-3",3,null,3,{"$f":"SUM('4.기관연구지원 시스템구축 및 운영'!K84:L84)","v":1},"O"]
[null,null,null,"④ 연구비통합관리시스템의 연동성","4-4",3,null,3,{"$f":"SUM('4.기관연구지원 시스템구축 및 운영'!K106:L106)","v":3},"O"]
[null,null,"5. 연구윤리 관리의 적절성\n(-6 ~ +2)","① 제재 통보 건수 및 연구비환수 금액","5-1","(-2~+2)","1)제재처분(참여제한, 제재부가금) 통보건수 및 제재 사유와 관련된 연구비환수 금액 현황","-2~0",{"$f":"SUM('5. 연구윤리관리의 적절성'!L31:M31)","v":-1},"O"]
[{"$nulls":6},"2)제재처분(참여제한, 제재부가금)의 원인이 내부신고 및 자체조사인 경우","0~2",{"$f":"SUM('5. 연구윤리관리의 적절성'!L32:M32)","v":0},"O"]
[null,null,null,"② 연구윤리 확립 노력 ","5-2","(-4)",null,"(-4)",{"$f":"SUM('5. 연구윤리관리의 적절성'!L62:M62)","v":-4},"O"]
[null,null,"소 계",null,null,"15(-4)",null,"15(-4)",{"$f":"SUM(I29:I36)","v":5},"-",{"$f":"I37-'0.출연(연) 등 평가지표 및 배점'!G30","v":0}]
[null,"Ⅳ. 연구제도 운영의 \n합리성","6. 국가연구개발사업 연구개발비 사용 기준 준수 여부(25(+3))","① 직접비 관리의 적절성","6-1","18(+1)","1) 인건비 – 인건비 계상률 관리의 적절성",3,{"$f":"SUM('6.국가R&D연구개발비 사용기준 준수여부'!K178:L178)","v":2},"O"]
[{"$nulls":6},"2) 인건비 – 고용(근로) 계약 체결의 적절성",3,{"$f":"SUM('6.국가R&D연구개발비 사용기준 준수여부'!K179:L179)","v":1},"O"]
[{"$nulls":6},"3)-1 연구시설･장비비 – 연구시설･장비의 중앙구매체계 운영 여부 및 이용 정도",3,{"$f":"SUM('6.국가R&D연구개발비 사용기준 준수여부'!K180:L180)","v":1},"O"]
[{"$nulls":6},"3)-2 연구시설･장비비 통합관리제 도입 및 내부 운영규정 마련 여부","+1",{"$f":"SUM('6.국가R&D연구개발비 사용기준 준수여부'!K181:L181)","v":0},"O"]
[{"$nulls":6},"4) 연구재료비 – 연구재료(시약포함)의 중앙구매체계 운영 여부 및 이용 정도",3,{"$f":"SUM('6.국가R&D연구개발비 사용기준 준수여부'!K182:L182)","v":1},"O"]
[{"$nulls":6},"5) 연구활동비 – 국내･외 여비, 전문가활용비, 회의비 및 식대",3,{"$f":"SUM('6.국가R&D연구개발비 사용기준 준수여부'!K183:L183)","v":2},"O"]
[{"$nulls":6},"6) 연구수당 – 기여도 평가 적절성",1,{"$f":"SUM('6.국가R&D연구개발비 사용기준 준수여부'!K184:L184)","v":1},"O"]
[{"$nulls":6},"7) 직접비(총괄) - 직접비 부당집행기준 위반 여부",2,{"$f":"SUM('6.국가R&D연구개발비 사용기준 준수여부'!K185:L185)","v":2},"O"]
[null,null,null,"② 간접비 관리의 적절성","6-2","7(+2)","1) 인력지원비 집행계획 수립 및 동 수립계획에 따른 집행여부",2,{"$f":"SUM('6.국가R&D연구개발비 사용기준 준수여부'!K299:L299)","v":2},"O"]
[{"$nulls":6},"2) 연구지원비 집행계획 수립 및 동 수립계획에 따른 집행여부",2,{"$f":"SUM('6.국가R&D연구개발비 사용기준 준수여부'!K300:L300)","v":1},"O"]
[{"$nulls":6},"3) 성과활용지원비 집행계획 수립 및 동 수립계획에 따른 집행규모-1) 성과활용지원비 집행계획 수립",1,{"$f":"SUM('6.국가R&D연구개발비 사용기준 준수여부'!K301:L301)","v":0},"O"]
[{"$nulls":6},"3) 성과활용지원비 집행계획 수립 및 동 수립계획에 따른 집행규모-2) 수립계획에 따른 집행 규모",1,{"$f":"SUM('6.국가R&D연구개발비 사용기준 준수여부'!K302:L302)","v":1},"O"]
[{"$nulls":6},"4) 연구보안관리비의 간접비 지출 규모","+2",{"$f":"SUM('6.국가R&D연구개발비 사용기준 준수여부'!K303:L303)","v":1},"O"]
[{"$nulls":6},"5) 연구실 안전관리비",1,{"$f":"SUM('6.국가R&D연구개발비 사용기준 준수여부'!K304:L304)","v":1},"O"]
[null,null,"소 계",null,null,"25(+3)",null,"25(+3)",{"$f":"SUM(I38:I51)","v":16},"-",{"$f":"I52-'0.출연(연) 등 평가지표 및 배점'!G33","v":0}]
[null,"Ⅴ. 연구자 애로사항 \n모니터링","7. 연구지원 서비스 만족도 및 우수사례(16)","① 연구지원 서비스 만족도 조사","7-1",10,null,10,{"$f":"SUM('7.연구지원 서비스만족도 및 우수사례'!K27:L27)","v":9},"O"]
[null,null,null,"② 연구지원을 위한 상시적인 모니터링에 따른 조치 우수사례","7-2",6,null,6,{"$f":"SUM('7.연구지원 서비스만족도 및 우수사례'!K57:L57)","v":6},"O"]
[null,null,"소 계",null,null,{"$f":"SUM(F53:F54)","v":16},null,{"$f":"SUM(H53:H54)","v":16},{"$f":"SUM(I53:I54)","v":15},"-"]
[null,"단순 점수 합계",null,null,null,{"$f":"SUM($F$17,$F$28,15,25,$F$55)","v":100},null,{"$f":"SUM($H$17,$H$28,15,25,$H$55)","v":100},{"$f":"SUM($I$17,$I$28,$I$37,$I$52,$I$55)","v":69},"-",{"$f":"I56-'0.출연(연) 등 평가지표 및 배점'!G37","v":0}]
[null,"변환 점수 합계\n(해당사항 없는 평가항목이 존재하는 경우 100점 만점으로 환산)",null,null,null,100,null,100,{"$f":"ROUND(I56/F56*100,2)","v":69},"-",{"$f":"I57-'0.출연(연) 등 평가지표 및 배점'!G38","v":0}]

{"sheet":"1.연구지원 조직역량강화노력","index":2,"n_rows":293,"n_cols":25,"rows_kept":293,"cut":false,"hidden":false,"merged":[[267,2,267,3],[267,4,267,5],[267,6,267,11],[267,12,267,13],[267,14,267,15],[267,16,267,17],[268,2,268,3],[268,4,268,5],[268,6,268,11],[268,12,268,13],[268,14,268,15],[268,16,268,17],[265,2,265,3],[265,4,265,5],[265,6,265,11],[265,12,265,13],[265,14,265,15],[265,16,265,17],[266,2,266,3],[266,4,266,5],[266,6,266,11],[266,12,266,13],[266,14,266,15],[266,16,266,17],[263,2,263,3],[263,4,263,5],[263,6,263,11],[263,12,263,13],[263,14,263,15],[263,16,263,17],[264,2,264,3],[264,4,264,5],[264,6,264,11],[264,12,264,13],[264,14,264,15],[264,16,264,17],[261,2,261,3],[261,4,261,5],[261,6,261,11],[261,12,261,13],[261,14,261,15],[261,16,261,17],[262,2,262,3],[262,4,262,5],[262,6,262,11],[262,12,262,13],[262,14,262,15],[262,16,262,17],[259,2,259,3],[259,4,259,5],[259,6,259,11],[259,12,259,13],[259,14,259,15],[259,16,259,17],[260,2,260,3],[260,4,260,5],[260,6,260,11],[260,12,260,13],[260,14,260,15],[260,16,260,17],[257,2,257,3],[257,4,257,5],[257,6,257,11],[257,12,257,13],[257,14,257,15],[257,16,257,17],[258,2,258,3],[258,4,258,5],[258,6,258,11],[258,12,258,13],[258,14,258,15],[258,16,258,17],[255,2,255,3],[255,4,255,5],[255,6,255,11],[255,12,255,13],[255,14,255,15],[255,16,255,17],[256,2,256,3],[256,4,256,5],[256,6,256,11],[256,12,256,13],[256,14,256,15],[256,16,256,17],[253,2,253,3],[253,4,253,5],[253,6,253,11],[253,12,253,13],[253,14,253,15],[253,16,253,17],[254,2,254,3],[254,4,254,5],[254,6,254,11],[254,12,254,13],[254,14,254,15],[254,16,254,17],[249,16,249,17],[250,6,250,11],[250,16,250,17],[251,6,251,11],[251,16,251,17],[252,2,252,3],[252,4,252,5],[252,6,252,11],[252,12,252,13],[252,14,252,15],[252,16,252,17],[247,2,247,3],[247,4,247,5],[247,6,247,11],[247,12,247,13],[247,14,247,15],[247,16,247,17],[248,2,248,3],[248,4,248,5],[248,6,248,11],[248,12,248,13],[248,14,248,15],[248,16,248,17],[245,2,245,3],[245,4,245,5],[245,6,245,11],[245,12,245,13],[245,14,245,15],[245,16,245,17],[246,2,246,3],[246,4,246,5],[246,6,246,11],[246,12,246,13],[246,14,246,15],[246,16,246,17],[243,2,243,3],[243,4,243,5],[243,6,243,11],[243,12,243,13],[243,14,243,15],[243,16,243,17],[244,2,244,3],[244,4,244,5],[244,6,244,11],[244,12,244,13],[244,14,244,15],[244,16,244,17],[241,16,241,17],[242,2,242,3],[242,4,242,5],[242,6,242,11],[242,12,242,13],[242,14,242,15],[242,16,242,17],[238,16,238,17],[239,2,239,3],[239,4,239,5],[239,6,239,11],[239,12,239,13],[239,14,239,15],[239,16,239,17],[240,2,240,3],[240,4,240,5],[240,6,240,11],[240,12,240,13],[240,14,240,15],[240,16,240,17],[235,2,235,3],[235,4,235,5],[235,6,235,11],[235,12,235,13],[235,14,235,15],[235,16,235,17],[236,1,268,1],[236,2,236,3],[236,4,236,5],[236,6,236,11],[236,12,236,13],[236,14,236,15],[236,16,236,17],[237,2,237,3],[237,4,237,5],[237,6,237,11],[237,12,237,13],[237,14,237,15],[237,16,237,17],[238,2,238,3],[238,4,238,5],[238,6,238,11],[238,12,238,13],[238,14,238,15],[250,12,250,13],[250,14,250,15],[249,6,249,11],[241,2,241,3],[241,4,241,5],[241,6,241,11],[241,12,241,13],[241,14,241,15],[233,2,233,3],[233,4,233,5],[233,6,233,11],[233,12,233,13],[233,14,233,15],[233,16,233,17],[234,2,234,3],[234,4,234,5],[234,6,234,11],[234,12,234,13],[234,14,234,15],[234,16,234,17],[231,2,231,3],[231,4,231,5],[231,6,231,11],[231,12,231,13],[231,14,231,15],[231,16,231,17],[232,2,232,3],[232,4,232,5],[232,6,232,11],[232,12,232,13],[232,14,232,15],[232,16,232,17],[229,2,229,3],[229,4,229,5],[229,6,229,11],[229,12,229,13],[229,14,229,15],[229,16,229,17],[230,2,230,3],[230,4,230,5],[230,6,230,11],[230,12,230,13],[230,14,230,15],[230,16,230,17],[227,2,227,3],[227,4,227,5],[227,6,227,11],[227,12,227,13],[227,14,227,15],[227,16,227,17],[228,2,228,3],[228,4,228,5],[228,6,228,11],[228,12,228,13],[228,14,228,15],[228,16,228,17],[225,2,225,3],[225,4,225,5],[225,6,225,11],[225,12,225,13],[225,14,225,15],[225,16,225,17],[226,2,226,3],[226,4,226,5],[226,6,226,11],[226,12,226,13],[226,14,226,15],[226,16,226,17],[223,2,223,3],[223,4,223,5],[223,6,223,11],[223,12,223,13],[223,14,223,15],[223,16,223,17],[224,2,224,3],[224,4,224,5],[224,6,224,11],[224,12,224,13],[224,14,224,15],[224,16,224,17],[221,2,221,3],[221,4,221,5],[221,6,221,11],[221,12,221,13],[221,14,221,15],[221,16,221,17],[222,2,222,3],[222,4,222,5],[222,6,222,11],[222,12,222,13],[222,14,222,15],[222,16,222,17],[219,2,219,3],[219,4,219,5],[219,6,219,11],[219,12,219,13],[219,14,219,15],[219,16,219,17],[220,2,220,3],[220,4,220,5],[220,6,220,11],[220,12,220,13],[220,14,220,15],[220,16,220,17],[217,2,217,3],[217,4,217,5],[217,6,217,11],[217,12,217,13],[217,14,217,15],[217,16,217,17],[218,2,218,3],[218,4,218,5],[218,6,218,11],[218,12,218,13],[218,14,218,15],[218,16,218,17],[215,2,215,3],[215,4,215,5],[215,6,215,11],[215,12,215,13],[215,14,215,15],[215,16,215,17],[216,2,216,3],[216,4,216,5],[216,6,216,11],[216,12,216,13],[216,14,216,15],[216,16,216,17],[213,2,213,3],[213,4,213,5],[213,6,213,11],[213,12,213,13],[213,14,213,15],[213,16,213,17],[214,2,214,3],[214,4,214,5],[214,6,214,11],[214,12,214,13],[214,14,214,15],[214,16,214,17],[211,2,211,3],[211,4,211,5],[211,6,211,11],[211,12,211,13],[211,14,211,15],[211,16,211,17],[212,2,212,3],[212,4,212,5],[212,6,212,11],[212,12,212,13],[212,14,212,15],[212,16,212,17],[208,16,208,17],[209,2,209,3],[209,4,209,5],[209,6,209,11],[209,12,209,13],[209,14,209,15],[209,16,209,17],[210,2,210,3],[210,4,210,5],[210,6,210,11],[210,12,210,13],[210,14,210,15],[210,16,210,17],[203,1,235,1],[203,2,203,3],[203,4,203,5],[203,6,203,11],[203,12,203,13],[203,14,203,15],[203,16,203,17],[204,2,204,3],[204,4,204,5],[204,6,204,11],[204,12,204,13],[204,14,204,15],[204,16,204,17],[205,2,205,3],[205,4,205,5],[205,6,205,11],[205,12,205,13],[205,14,205,15],[205,16,205,17],[206,2,206,3],[206,4,206,5],[206,6,206,11],[206,12,206,13],[206,14,206,15],[144,2,144,3],[144,4,144,5],[144,6,144,11],[144,12,144,13],[144,14,144,15],[144,16,144,17],[145,2,145,3],[145,4,145,5],[145,6,145,11],[145,12,145,13],[145,14,145,15],[145,16,145,17],[198,16,198,17],[196,16,196,17],[197,10,197,11],[197,16,197,17],[194,12,198,13],[194,14,198,15],[194,16,194,17],[195,10,195,11],[195,16,195,17],[196,10,196,11],[169,1,169,10],[169,11,169,12],[169,13,169,15],[175,1,181,15],[167,1,167,10],[142,2,142,3],[142,4,142,5],[142,6,142,11],[142,12,142,13],[142,14,142,15],[142,16,142,17],[143,2,143,3],[143,4,143,5],[143,6,143,11],[143,12,143,13],[143,14,143,15],[143,16,143,17],[140,2,140,3],[140,4,140,5],[140,6,140,11],[140,12,140,13],[140,14,140,15],[140,16,140,17],[141,2,141,3],[141,4,141,5],[141,6,141,11],[141,12,141,13],[141,14,141,15],[141,16,141,17],[138,2,138,3],[138,4,138,5],[138,6,138,11],[138,12,138,13],[138,14,138,15],[138,16,138,17],[139,2,139,3],[139,4,139,5],[139,6,139,11],[139,12,139,13],[139,14,139,15],[139,16,139,17],[136,2,136,3],[136,4,136,5],[136,6,136,11],[136,12,136,13],[136,14,136,15],[136,16,136,17],[137,2,137,3],[137,4,137,5],[137,6,137,11],[137,12,137,13],[137,14,137,15],[137,16,137,17],[134,2,134,3],[134,4,134,5],[134,6,134,11],[134,12,134,13],[134,14,134,15],[134,16,134,17],[135,2,135,3],[135,4,135,5],[135,6,135,11],[135,12,135,13],[135,14,135,15],[135,16,135,17],[132,2,132,3],[132,4,132,5],[132,6,132,11],[132,12,132,13],[132,14,132,15],[132,16,132,17],[133,2,133,3],[133,4,133,5],[133,6,133,11],[133,12,133,13],[133,14,133,15],[133,16,133,17],[130,2,130,3],[130,4,130,5],[130,6,130,11],[130,12,130,13],[130,14,130,15],[130,16,130,17],[131,2,131,3],[131,4,131,5],[131,6,131,11],[131,12,131,13],[131,14,131,15],[131,16,131,17],[128,2,128,3],[128,4,128,5],[128,6,128,11],[128,12,128,13],[128,14,128,15],[128,16,128,17],[129,2,129,3],[129,4,129,5],[129,6,129,11],[129,12,129,13],[129,14,129,15],[129,16,129,17],[127,2,127,3],[127,4,127,5],[127,6,127,11],[127,12,127,13],[127,14,127,15],[127,16,127,17],[126,16,126,17],[123,16,123,17],[124,2,124,3],[124,4,124,5],[124,6,124,11],[124,12,124,13],[124,14,124,15],[124,16,124,17],[125,2,125,3],[125,4,125,5],[125,6,125,11],[125,12,125,13],[125,14,125,15],[125,16,125,17],[123,2,123,3],[123,4,123,5],[123,6,123,11],[123,12,123,13],[123,14,123,15],[126,2,126,3],[126,4,126,5],[126,6,126,11],[126,12,126,13],[126,14,126,15],[122,2,122,3],[122,4,122,5],[122,6,122,11],[122,12,122,13],[122,14,122,15],[122,16,122,17],[117,16,117,17],[118,2,118,3],[118,4,118,5],[118,6,118,11],[118,12,118,13],[118,14,118,15],[118,16,118,17],[119,2,119,3],[119,4,119,5],[119,6,119,11],[119,12,119,13],[119,14,119,15],[119,16,119,17],[117,14,117,15],[108,16,108,17],[109,2,109,3],[109,4,109,5],[109,6,109,11],[109,12,109,13],[109,14,109,15],[109,16,109,17],[110,2,110,3],[110,4,110,5],[110,6,110,11],[110,12,110,13],[110,14,110,15],[110,16,110,17],[120,16,120,17],[121,2,121,3],[121,4,121,5],[121,6,121,11],[121,12,121,13],[121,14,121,15],[121,16,121,17],[75,2,75,9],[112,6,112,11],[104,2,104,3],[104,4,104,5],[104,6,104,11],[104,12,104,13],[104,14,104,15],[104,16,104,17],[105,2,105,3],[105,4,105,5],[105,6,105,11],[105,12,105,13],[105,14,105,15],[105,16,105,17],[106,2,106,3],[106,4,106,5],[106,6,106,11],[106,12,106,13],[106,14,106,15],[106,16,106,17],[107,2,107,3],[107,4,107,5],[107,6,107,11],[107,12,107,13],[95,2,95,3],[95,4,95,5],[95,6,95,11],[95,12,95,13],[95,14,95,15],[107,14,107,15],[107,16,107,17],[108,2,108,3],[95,16,95,17],[96,2,96,3],[96,4,96,5],[93,16,93,17],[94,2,94,3],[94,4,94,5],[94,6,94,11],[94,12,94,13],[94,14,94,15],[94,16,94,17],[91,2,91,3],[91,4,91,5],[91,6,91,11],[91,12,91,13],[91,14,91,15],[91,16,91,17],[92,2,92,3],[92,4,92,5],[92,6,92,11],[92,12,92,13],[92,14,92,15],[92,16,92,17],[79,6,79,11],[80,6,80,11],[81,6,81,11],[82,6,82,11],[83,6,83,11],[84,6,84,11],[99,6,99,11],[100,6,100,11],[85,6,85,11],[85,12,85,13],[85,14,85,15],[85,16,85,17],[86,6,86,11],[86,12,86,13],[86,14,86,15],[86,16,86,17],[87,6,87,11],[97,6,97,11],[97,12,97,13],[97,14,97,15],[97,16,97,17],[98,6,98,11],[98,12,98,13],[98,14,98,15],[98,16,98,17],[96,6,96,11],[96,12,96,13],[96,14,96,15],[96,16,96,17],[93,6,93,11],[93,12,93,13],[93,14,93,15],[202,4,202,5],[202,6,202,11],[202,12,202,13],[202,14,202,15],[202,16,202,17],[206,16,206,17],[249,2,249,3],[249,4,249,5],[249,12,249,13],[249,14,249,15],[250,2,250,3],[250,4,250,5],[89,2,89,3],[89,4,89,5],[89,6,89,11],[89,12,89,13],[89,14,89,15],[89,16,89,17],[90,2,90,3],[90,4,90,5],[90,6,90,11],[90,12,90,13],[90,14,90,15],[90,16,90,17],[114,16,114,17],[115,16,115,17],[116,16,116,17],[111,12,111,13],[111,14,111,15],[111,16,111,17],[102,2,102,3],[102,4,102,5],[80,16,80,17],[81,16,81,17],[82,16,82,17],[83,16,83,17],[84,16,84,17],[99,16,99,17],[100,16,100,17],[112,16,112,17],[113,16,113,17],[87,16,87,17],[88,16,88,17],[101,16,101,17],[102,6,102,11],[102,12,102,13],[102,14,102,15],[102,16,102,17],[103,2,103,3],[103,4,103,5],[103,6,103,11],[103,12,103,13],[103,14,103,15],[103,16,103,17],[112,12,112,13],[112,14,112,15],[101,2,101,3],[101,4,101,5],[101,6,101,11],[101,12,101,13],[101,14,101,15],[88,4,88,5],[88,6,88,11],[88,12,88,13],[120,14,120,15],[97,2,97,3],[97,4,97,5],[98,2,98,3],[98,4,98,5],[93,2,93,3],[93,4,93,5],[113,6,113,11],[114,6,114,11],[115,6,115,11],[116,6,116,11],[117,2,117,3],[117,4,117,5],[117,6,117,11],[117,12,117,13],[86,2,86,3],[86,4,86,5],[87,2,87,3],[87,4,87,5],[87,12,87,13],[87,14,87,15],[88,2,88,3],[111,2,111,3],[111,4,111,5],[111,6,111,11],[108,4,108,5],[108,6,108,11],[108,12,108,13],[108,14,108,15],[88,14,88,15],[113,1,145,1],[113,2,113,3],[113,4,113,5],[113,12,113,13],[113,14,113,15],[114,2,114,3],[114,4,114,5],[114,12,114,13],[114,14,114,15],[115,2,115,3],[115,4,115,5],[115,12,115,13],[115,14,115,15],[116,2,116,3],[116,4,116,5],[100,2,100,3],[100,4,100,5],[100,12,100,13],[100,14,100,15],[112,2,112,3],[112,4,112,5],[80,1,112,1],[80,2,80,3],[80,4,80,5],[80,12,80,13],[116,12,116,13],[116,14,116,15],[120,2,120,3],[120,4,120,5],[120,6,120,11],[120,12,120,13],[83,2,83,3],[83,4,83,5],[71,16,71,17],[70,16,70,17],[290,1,290,10],[290,11,290,12],[290,13,290,15],[291,1,291,10],[291,11,291,12],[291,13,291,15],[286,2,286,15],[288,1,288,10],[288,11,288,12],[288,13,288,15],[289,1,289,10],[289,11,289,12],[289,13,289,15],[281,1,281,2],[281,3,281,15],[281,16,281,17],[283,2,283,15],[284,2,284,15],[285,2,285,15],[84,4,84,5],[84,12,84,13],[84,14,84,15],[99,2,99,3],[99,4,99,5],[99,12,99,13],[99,14,99,15],[85,2,85,3],[85,4,85,5],[276,2,276,15],[279,1,279,2],[279,3,279,15],[279,16,279,17],[280,1,280,2],[280,3,280,15],[280,16,280,17],[199,14,199,15],[199,16,199,17],[272,2,272,15],[273,2,273,15],[274,2,274,15],[275,2,275,15],[199,10,199,11],[199,12,199,13],[207,2,207,3],[207,4,207,5],[207,6,207,11],[207,12,207,13],[207,14,207,15],[207,16,207,17],[208,2,208,3],[208,4,208,5],[208,6,208,11],[208,12,208,13],[208,14,208,15],[251,2,251,3],[251,4,251,5],[251,12,251,13],[251,14,251,15],[199,2,199,9],[202,2,202,3],[194,1,198,1],[194,10,194,11],[198,10,198,11],[192,10,192,11],[191,10,191,11],[193,10,193,11],[193,16,193,17],[192,16,192,17],[188,16,188,17],[189,1,193,1],[189,10,189,11],[189,12,193,13],[189,14,193,15],[191,16,191,17],[189,16,189,17],[190,10,190,11],[190,16,190,17],[188,2,188,3],[188,4,188,5],[188,6,188,7],[188,8,188,9],[188,10,188,11],[188,12,188,13],[188,14,188,15],[189,2,193,9],[194,2,198,9],[167,11,167,12],[167,13,167,15],[168,1,168,10],[168,11,168,12],[168,13,168,15],[161,2,161,15],[162,2,162,15],[163,2,163,15],[164,2,164,15],[166,1,166,10],[166,11,166,12],[166,13,166,15],[158,1,158,2],[158,3,158,15],[158,16,158,17],[159,1,159,2],[159,3,159,15],[159,16,159,17],[153,2,153,15],[156,1,156,2],[156,3,156,15],[156,16,156,17],[157,1,157,2],[157,3,157,15],[157,16,157,17],[75,14,75,15],[75,16,75,17],[149,2,149,15],[150,2,150,15],[151,2,151,15],[152,2,152,15],[75,10,75,11],[75,12,75,13],[79,2,79,3],[79,4,79,5],[79,12,79,13],[79,14,79,15],[79,16,79,17],[83,12,83,13],[83,14,83,15],[84,2,84,3],[80,14,80,15],[81,2,81,3],[81,4,81,5],[81,12,81,13],[81,14,81,15],[82,2,82,3],[82,4,82,5],[82,12,82,13],[82,14,82,15],[74,16,74,17],[72,16,72,17],[73,10,73,11],[73,16,73,17],[70,12,74,13],[70,14,74,15],[71,10,71,11],[70,1,74,1],[70,10,70,11],[72,10,72,11],[74,10,74,11],[70,2,74,9],[68,16,68,17],[67,10,67,11],[67,16,67,17],[69,10,69,11],[69,16,69,17],[65,2,69,9],[65,16,65,17],[66,10,66,11],[66,16,66,17],[64,14,64,15],[64,16,64,17],[65,1,69,1],[65,10,65,11],[65,12,69,13],[65,14,69,15],[45,1,45,10],[45,11,45,12],[45,13,45,15],[51,1,57,14],[64,2,64,3],[64,4,64,5],[64,6,64,7],[64,8,64,9],[64,10,64,11],[64,12,64,13],[68,10,68,11],[39,2,39,15],[40,2,40,15],[41,2,41,15],[42,2,42,15],[44,1,44,10],[44,11,44,12],[44,13,44,15],[36,2,36,4],[36,6,36,9],[36,10,36,12],[36,13,36,15],[37,2,37,4],[37,6,37,9],[37,10,37,12],[37,13,37,15],[23,1,23,10],[23,11,23,12],[23,13,23,14],[29,1,32,15],[34,1,35,1],[34,2,34,15],[35,2,35,4],[35,6,35,9],[35,10,35,12],[35,13,35,15],[17,2,17,14],[18,2,18,14],[19,2,19,14],[20,2,20,14],[22,1,22,10],[22,11,22,12],[22,13,22,14],[11,9,12,9],[11,11,12,11],[11,12,12,12],[11,13,12,13],[11,14,12,14],[16,2,16,14],[3,1,8,14],[10,1,12,1],[10,2,10,14],[11,2,12,2]],"merged_total":1006,"flags":["merged_cut"]}
[]
[null,"1-1. 전담조직 내 연구지원 별도기능 설치"]
[]
[null,"* 작성시 유의사항\n- 인원수 소계는 반드시 2-1(연구지원인력(B+C) 현황)와 동일할 것\n- 하기 템플릿에 대하여 행, 열의 삽입 또는 삭제하지 않음\n- 2021.12.31.일자 기준으로 작성\n- 자체평가 셀에 있는 함수는 수정하지 않음"]
[]
[]
[]
[]
[]
[]
[null,"기관명","전담조직 내 연구지원 기능 보유 여부"]
[null,null,"①연구\n기획","②협약","③정산","④구매","⑤자산","⑥검수","⑦재무 및\n회계","⑧감사","⑨성과\n관리","⑩연구\n윤리","⑪연구\n보안","기타(연구\n근접지원\n인력 포함)","소계"]
[{"$nulls":10},"활용",{"$nulls":5},"(2-1)연구지원인력현황(B+C)과"]
[null,"기능 설치여부","O","O","O","O","O","O","O","O","X","X","X","O",{"$f":"COUNTIF(C14:N14,V14)","v":9},null,"일치 여부",null,{"$f":"O15=SUM('2.연구지원 인력의 운영수준'!P17:P18)","v":true},null,null,"O"]
[null,"인원수",20,15,20,31,42,20,15,5,0,0,0,8,{"$f":"SUM(C15:N15)","v":176},null,"(1-3) 교육실적과 일치 여부",null,{"$f":"O15=M71","v":true},null,null,"X"]
[{"$nulls":16},"(FALSE인 경우 인원수 수정 필요)"]
[null,"점수","평가지침"]
[null,"3점","전담조직 내 상기 ①~⑪개 기능 중 7개 이상의 기능이 별도로 설치된 경우",{"$nulls":18},0,0]
[null,"2점","전담조직 내 상기 ①~⑪개 기능 중 6개의 기능이 별도로 설치된 경우",{"$nulls":18},4,0]
[null,"1점","전담조직 내 상기 ①~⑪개 기능 중 5개의 기능이 별도로 설치된 경우",{"$nulls":18},5,1]
[null,"0점","전담조직 내 상기 ①~⑪개 기능 중 4개 이하의 기능이 별도로 설치된 경우",{"$nulls":18},6,2]
[{"$nulls":21},7,3]
[null,"세부평가지표",{"$nulls":9},"배점",null,"자체평가",{"$nulls":7},12,3]
[null,"1-1. 전담조직 내 연구지원 별도기능 설치",{"$nulls":9},3,null,{"$f":"VLOOKUP(O14,$V$18:$W$23,2,1)","v":3}]
[]
[]
[]
[null,"1-2. 연구지원 전담조직의 연구장비･재료(시약포함) 전담검수인력 확보"]
[]
[null,"* 작성시 유의사항\n- 2021.12.31.일자 기준으로 작성\n- 총 인원이 0명이라고 하더라도 빈칸으로 두지 말고 0명으로 작성"]
[]
[]
[]
[]
[null,"기관명","전담조직 내 연구장비･재료(시약포함) 전담 검수인력 수(명)"]
[null,null,"부서명",null,null,"성명","사번",null,null,null,"업무분장기간",null,null,"총 인원"]
[null,"전담자","구매자산팀\n구매자산팀\n구매자산팀",null,null,"박00\n김00\n이00","00000\n000\n00",null,null,null,"2020.3.1.~현재\n2020.1.2.~\n2020.1.2.~",null,null,3]
[null,"겸직자","구매자산팀\n구매자산팀\n구매자산팀",null,null,"박00\n김00\n이00","00000\n000\n00",null,null,null,"2020.3.1.~현재\n2020.1.2.~\n2020.1.2.~",null,null,3]
[]
[null,"점수","평가지침"]
[null,"3점","연구장비･재료(시약포함)의 전담 검수인력이 1명 이상 있는 경우 "]
[null,"2점","연구장비･재료(시약포함)의 전담 검수인력은 없으나 겸직자가 있어 이를 겸업하는 경우 "]
[null,"0점","연구장비･재료(시약포함)의 전담 검수인력 및 겸직자가 모두 없는 경우"]
[]
[null,"세부평가지표",{"$nulls":9},"배점",null,"자체평가"]
[null,"1-2. 연구지원 전담조직의 연구장비･재료(시약포함) 전담검수인력 확보",{"$nulls":9},3,null,{"$f":"IF(N37>=1,3,IF(N38>=1,2,0))","v":3}]
[]
[]
[]
[null,"1-3. 연구지원인력에 대한 교육실적"]
[]
[null,"* 작성시 유의사항\n- 최근1년전 전체 연구지원인력은 반드시 2-1(연구지원인력(B+C) 현황)와 동일할 것\n- 2021.12.31.일자 기준으로 작성\n- 교육실적으로 인정되는 교육의 경우 교육 시간이 최소 60분 이상인 경우만 인정\n- 세부내역 비고1 란은 ’연구비 집행, 보안관리, 성과관리, 연구윤리, 기타‘ 중에서 선택하여 입력\n- ② 연구지원인력 우수 교육사례에서 인정 여부를 표시할 것"]
[]
[{"$nulls":21},"연구비 집행"]
[{"$nulls":21},"보안관리"]
[{"$nulls":21},"성과관리"]
[{"$nulls":21},"연구윤리"]
[{"$nulls":21},"기타"]
[]
[null,"① 연구지원인력에 대한 교육실적 "]
[]
[null," - 연구지원인력 교육실적 총괄표"]
[null,"   (총괄표 중 교육참여인원과 비고1/비고2은 직접 입력하지 않고 세부내역을 작성하면 자동으로 입력됨. 전체 연구지원인력과 총 교육횟수는 직접 입력함. "]
[null,"   (교육실적 세부내역은 아래 그룹을 해제하고 작성)"]
[null,"구분","교육기간",null,"교육 주체",null,"교육명",null,"교육방법\n(온라인/오프라인)",null,"교육참여 \n인원 (자동입력)",null,"전체 \n연구지원인력",null,"연간 총 교육횟수",null,"비고1\n(고정값)",null,"비고2\n(자동입력)"]
[null,"최근2년전","(구체적인 교육실적은 아래 세부내역 그룹을 열어 작성 요망)",{"$nulls":7},{"$f":"SUMIF($Q$81:$R$113,Q66,$O$81:$P$113)","v":10},null,177,null,10,null,"연구비 집행",null,{"$f":"IFERROR(IF(K66/$M$66>=20%,\"O\",\"X\"),0)","v":"X"},null,null,{"$f":"Q66&S66","v":"연구비 집행X"},"연구비 집행O",{"$f":"COUNTIF($V$66:$V$75,W66)","v":1},{"$f":"IF(X66>=1,1,0)","v":1}]
[{"$nulls":10},{"$f":"SUMIF($Q$81:$R$113,Q67,$O$81:$P$113)","v":40},{"$nulls":5},"보안관리",null,{"$f":"IFERROR(IF(K67/$M$66>=20%,\"O\",\"X\"),0)","v":"O"},null,null,{"$f":"Q67&S67","v":"보안관리O"},"보안관리O",{"$f":"COUNTIF($V$66:$V$75,W67)","v":2},{"$f":"IF(X67>=1,1,0)","v":1}]
[{"$nulls":10},{"$f":"SUMIF($Q$81:$R$113,Q68,$O$81:$P$113)","v":30},{"$nulls":5},"성과관리",null,"X",null,null,"성과관리X","성과관리O",{"$f":"COUNTIF($V$66:$V$75,W68)","v":0},{"$f":"IF(X68>=1,1,0)","v":0}]
[{"$nulls":10},{"$f":"SUMIF($Q$81:$R$113,Q69,$O$81:$P$113)","v":20},{"$nulls":5},"연구윤리",null,"X",null,null,"연구윤리X","연구윤리O",{"$f":"COUNTIF($V$66:$V$75,W69)","v":0},{"$f":"IF(X69>=1,1,0)","v":0}]
[{"$nulls":10},{"$f":"SUMIF($Q$81:$R$113,Q70,$O$81:$P$113)","v":50},{"$nulls":5},"기타",null,"O",null,null,"기타O","기타O",{"$f":"COUNTIF($V$66:$V$75,W70)","v":1},{"$f":"IF(X70>=1,1,0)","v":1}]
[null,"최근1년전","(구체적인 교육실적은 아래 세부내역 그룹을 열어 작성 요망)",{"$nulls":7},{"$f":"SUMIF($Q$114:$R$146,Q71,$O$114:$P$146)","v":50},null,176,null,10,null,"연구비 집행",null,{"$f":"IFERROR(IF(K71/$M$71>=20%,\"O\",\"X\"),0)","v":"O"},null,null,"연구비 집행O",null,"합계",{"$f":"SUM(Y66:Y70)","v":3}]
[{"$nulls":10},{"$f":"SUMIF($Q$114:$R$146,Q72,$O$114:$P$146)","v":40},{"$nulls":5},"보안관리",null,"O",null,null,"보안관리O"]
[{"$nulls":10},{"$f":"SUMIF($Q$114:$R$146,Q73,$O$114:$P$146)","v":30},{"$nulls":5},"성과관리",null,"X",null,null,"성과관리X"]
[{"$nulls":10},{"$f":"SUMIF($Q$114:$R$146,Q74,$O$114:$P$146)","v":20},{"$nulls":5},"연구윤리",null,"X",null,null,"연구윤리X"]
[{"$nulls":10},{"$f":"SUMIF($Q$114:$R$146,Q75,$O$114:$P$146)","v":10},{"$nulls":5},"기타",null,"X",null,null,"기타X"]
[null,"2개년 합계",{"$nulls":12},{"$f":"SUM(O66:P75)","v":20},null,null,null,{"$f":"IFERROR(IF(K76/M76>=20%,\"O\",\"X\"),\"\")","v":""}]
[]
[]
[null," - 연구지원인력 교육실적 세부내역"]
[null,"구분","교육기간",null,"교육 주체",null,"교육명",{"$nulls":5},"교육방법\n(온라인/오프라인)",null,"교육참여 \n인원",null,"비고1\n(반드시 선택)"]
[null,"최근2년전","2020-09-01",null,"본부",null,"00교육",{"$nulls":5},"온라인",null,5,null,"연구비 집행"]
[null,null,"2020-10-01~\n2020-10-02",null,"본부",{"$nulls":7},"온라인",null,10,null,"보안관리"]
[null,null,"2020-09-01",null,"본부",{"$nulls":7},"온라인",null,15,null,"성과관리"]
[null,null,"2020-09-01",null,"본부",{"$nulls":7},"온라인",null,20,null,"연구윤리"]
[null,null,"2020-09-01",null,"본부",{"$nulls":7},"온라인",null,25,null,"기타"]
[null,null,"2020-09-01",null,"본부",{"$nulls":7},"온라인",null,5,null,"연구비 집행"]
[null,null,"2020-09-01",null,"본부",{"$nulls":7},"온라인",null,10,null,"보안관리"]
[null,null,"2020-09-01",null,"본부",{"$nulls":7},"온라인",null,15,null,"성과관리"]
[null,null,"2020-09-01",null,"본부",{"$nulls":7},"온라인",null,20,null,"보안관리"]
[null,null,"2020-09-01",null,"본부",{"$nulls":7},"온라인",null,25,null,"기타"]
{"$rows_empty":23}
[null,"최근1년전","2021-09-01",null,"본부",{"$nulls":7},"온라인",null,25,null,"연구비 집행"]
[null,null,"2021-10-01~\n2021-10-02",null,"본부",{"$nulls":7},"온라인",null,20,null,"보안관리"]
[null,null,"2021-09-01",null,"본부",{"$nulls":7},"온라인",null,15,null,"성과관리"]
[null,null,"2021-09-01",null,"본부",{"$nulls":7},"온라인",null,10,null,"연구윤리"]
[null,null,"2021-09-01",null,"본부",{"$nulls":7},"온라인",null,5,null,"기타"]
[null,null,"2021-09-01",null,"본부",{"$nulls":7},"온라인",null,25,null,"연구비 집행"]
[null,null,"2021-09-01",null,"본부",{"$nulls":7},"온라인",null,20,null,"보안관리"]
[null,null,"2021-09-01",null,"본부",{"$nulls":7},"온라인",null,15,null,"성과관리"]
[null,null,"2021-09-01",null,"본부",{"$nulls":7},"온라인",null,10,null,"연구윤리"]
[null,null,"2021-09-01",null,"본부",{"$nulls":7},"온라인",null,5,null,"기타"]
{"$rows_empty":26}
[null,"점수","평가지침"]
[null,"3점","전체연구지원인력 대비 교육참여인원 수가 20%이상이고, 연구 지원 교육(연구비 집행, 보안관리, 성과관리, 연구윤리, 기타)을 총 5회(각 1회씩 반드시)이상을 실시한 경우 "]
[null,"2점","전체연구지원인력 대비 교육참여인원 수가 20%이상이고, 연구 지원 교육(연구비 집행, 보안관리, 성과관리, 연구윤리, 기타)을 총 4회(항목무관)이상을 실시한 경우"]
[null,"1점","전체연구지원인력 대비 교육참여인원 수가 20%이상이고, 연구 지원 교육(연구비 집행, 보안관리, 성과관리, 연구윤리, 기타)을 총 3회(항목무관)이상을 실시한 경우 "]
[null,"0점","전체연구지원인력 대비 교육참여인원 수가 20%이상이고, 연구 지원 교육(연구비 집행, 보안관리, 성과관리, 연구윤리, 기타)을 총 2회(항목무관)이하 실시한 경우 "]
[]
[null,"② 연구지원인력 우수 교육사례"]
[null,"특성화 구분",null,"우수사례 및 주요실적",{"$nulls":12},"인정여부\n(인정 1, 불인정 0)"]
[null,"기관 특성",null,"입력",{"$nulls":12},1,{"$nulls":4},1]
[null,"부서·조직 특성",null,"입력",{"$nulls":12},1,{"$nulls":4},0]
[null,"연구지원인력 특성",null,"입력",{"$nulls":12},1]
[]
[null,"점수","평가지침"]
[null,"2점","3개 특성화 우수사례가 인정된 경우\n\t1) 기관 특성\n\t2) 부서·조직 특성\n\t3) 연구지원인력 특성"]
[null,"1점","2개 특성화 우수사례가 인정된 경우"]
[null,"0점","1개 이하 특성화 우수사례가 인정된 경우"]
[]
[null,"세부평가지표",{"$nulls":9},"배점",null,"자체평가",{"$nulls":7},0,0]
[null,"1-3. ① 연구지원인력에 대한 교육실적 ",{"$nulls":9},3,null,{"$f":"VLOOKUP(Y71,$V$167:$W$171,2,1)","v":1},{"$nulls":7},3,1]
[null,"1-3. ② 연구지원인력 우수 교육사례",{"$nulls":9},2,null,{"$f":"IF(SUM(Q158:R160)=3,2,IF(SUM(Q158:R160)=2,1,0))","v":2},{"$nulls":7},4,2]
[null,"1-3. 연구지원인력에 대한 교육실적",{"$nulls":9},5,null,{"$f":"SUM(N168:P169)","v":3},{"$nulls":7},5,3]
[{"$nulls":21},100,4]
[]
[]
[null,"1-4. 연구자에 대한 교육실적"]
[]
[null,"* 작성시 유의사항\n- 최근1년전 전체 연구인력은 반드시 2-1(전체연구인력(A))와 동일할 것\n-  2021.12.31.일자 기준으로 작성\n- 교육실적으로 인정되는 교육의 경우 교육 시간이 최소 60분 이상인 경우만 인정\n- 비고1 란은 ’연구비 집행, 보안관리, 성과관리, 연구윤리, 기타‘ 중에서 선택하여 입력\n- ② 연구자 우수 교육사례에서 인정 여부를 표시할 것"]
{"$rows_empty":7}
[null,"① 연구자에 대한 교육실적"]
[]
[null," - 연구자 교육실적 총괄표"]
[null,"   (총괄표 중 교육참여인원과 비고1/비고2은 직접 입력하지 않고 세부내역을 작성하면 자동으로 입력됨. 전체 연구지원인력과 총 교육횟수는 직접 입력함. "]
[null,"   (교육실적 세부내역은 아래 그룹을 해제하고 작성)"]
[null,"구분","교육기간",null,"교육 주체",null,"교육명",null,"교육방법\n(온라인/오프라인)",null,"교육참여 인원",null,"전체 연구인력",null,"연간 총 교육회수",null,"비고1\n(고정값)",null,"비고2"]
[null,"최근2년전","(구체적인 교육실적은 아래 세부내역 그룹을 열어 작성 요망)",{"$nulls":7},{"$f":"SUMIF($Q$204:$R$236,Q190,$O$204:$P$236)","v":5},null,300,null,null,null,"연구비 집행",null,{"$f":"IFERROR(IF(K190>=1,\"O\",\"X\"),\"\")","v":"O"},null,null,{"$f":"Q190&S190","v":"연구비 집행O"},"연구비 집행O",{"$f":"COUNTIF($V$190:$V$199,W190)","v":2},{"$f":"IF(X190>=1,1,0)","v":1}]
[{"$nulls":10},{"$f":"SUMIF($Q$204:$R$236,Q191,$O$204:$P$236)","v":5},{"$nulls":5},"보안관리",null,"O",null,null,{"$f":"Q191&S191","v":"보안관리O"},"보안관리O",{"$f":"COUNTIF($V$190:$V$199,W191)","v":2},{"$f":"IF(X191>=1,1,0)","v":1}]
[{"$nulls":10},{"$f":"SUMIF($Q$204:$R$236,Q192,$O$204:$P$236)","v":0},{"$nulls":5},"성과관리",null,"X",null,null,"성과관리X","성과관리O",{"$f":"COUNTIF($V$190:$V$199,W192)","v":0},{"$f":"IF(X192>=1,1,0)","v":0}]
[{"$nulls":10},{"$f":"SUMIF($Q$204:$R$236,Q193,$O$204:$P$236)","v":5},{"$nulls":5},"연구윤리",null,"O",null,null,"연구윤리O","연구윤리O",{"$f":"COUNTIF($V$190:$V$199,W193)","v":2},{"$f":"IF(X193>=1,1,0)","v":1}]
[{"$nulls":10},{"$f":"SUMIF($Q$204:$R$236,Q194,$O$204:$P$236)","v":5},{"$nulls":5},"기타",null,"O",null,null,"기타O","기타O",{"$f":"COUNTIF($V$190:$V$199,W194)","v":2},{"$f":"IF(X194>=1,1,0)","v":1}]
[null,"최근1년전","(구체적인 교육실적은 아래 세부내역 그룹을 열어 작성 요망)",{"$nulls":7},{"$f":"SUMIF($Q$237:$R$269,Q195,$O$237:$P$269)","v":5},{"$nulls":5},"연구비 집행",null,"O",null,null,"연구비 집행O",null,"합계",{"$f":"SUM(Y190:Y194)","v":4}]
[{"$nulls":10},{"$f":"SUMIF($Q$237:$R$269,Q196,$O$237:$P$269)","v":5},{"$nulls":5},"보안관리",null,"O",null,null,"보안관리O"]
[{"$nulls":10},{"$f":"SUMIF($Q$237:$R$269,Q197,$O$237:$P$269)","v":0},{"$nulls":5},"성과관리",null,"X",null,null,"성과관리X"]
[{"$nulls":10},{"$f":"SUMIF($Q$237:$R$269,Q198,$O$237:$P$269)","v":5},{"$nulls":5},"연구윤리",null,"O",null,null,"연구윤리O"]
[{"$nulls":10},{"$f":"SUMIF($Q$237:$R$269,Q199,$O$237:$P$269)","v":5},{"$nulls":5},"기타",null,"O",null,null,"기타O"]
[null,"2개년 합계",{"$nulls":16},{"$f":"IFERROR(IF(K200/M200>=20%,\"O\",\"X\"),\"\")","v":""}]
[]
[null," - 연구자 교육실적 세부내역"]
[null,"구분","교육기간",null,"교육 주체",null,"교육명",{"$nulls":5},"교육방법\n(온라인/오프라인)",null,"교육참여 \n인원",null,"비고1\n(반드시 선택)"]
[null,"최근2년전","2020-09-01",null,"본부",{"$nulls":7},"온라인",null,5,null,"연구비 집행"]
[null,null,"2020-10-01~\n2020-10-02",null,"본부",{"$nulls":7},"온라인",null,5,null,"보안관리"]
[null,null,"2020-09-01",null,"본부",{"$nulls":7},"온라인",null,0,null,"성과관리"]
[null,null,"2020-09-01",null,"본부",{"$nulls":7},"온라인",null,0,null,"연구윤리"]
[null,null,"2020-09-01",null,"본부",{"$nulls":7},"온라인",null,0,null,"기타"]
[null,null,"2020-09-01",null,"본부",{"$nulls":7},"온라인",null,0,null,"연구비 집행"]
[null,null,"2020-09-01",null,"본부",{"$nulls":7},"온라인",null,0,null,"보안관리"]
[null,null,"2020-09-01",null,"본부",{"$nulls":7},"온라인",null,0,null,"성과관리"]
[null,null,"2020-09-01",null,"본부",{"$nulls":7},"온라인",null,5,null,"연구윤리"]
[null,null,"2020-09-01",null,"본부",{"$nulls":7},"온라인",null,5,null,"기타"]
{"$rows_empty":23}
[null,"최근1년전","2021-09-01",null,"본부",{"$nulls":7},"온라인",null,5,null,"연구비 집행"]
[null,null,"2021-10-01~\n2021-10-02",null,"본부",{"$nulls":7},"온라인",null,5,null,"보안관리"]
[null,null,"2021-09-01",null,"본부",{"$nulls":7},"온라인",null,0,null,"성과관리"]
[null,null,"2021-09-01",null,"본부",{"$nulls":7},"온라인",null,0,null,"연구윤리"]
[null,null,"2021-09-01",null,"본부",{"$nulls":7},"온라인",null,0,null,"기타"]
[null,null,"2021-09-01",null,"본부",{"$nulls":7},"온라인",null,0,null,"연구비 집행"]
[null,null,"2021-09-01",null,"본부",{"$nulls":7},"온라인",null,0,null,"보안관리"]
[null,null,"2021-09-01",null,"본부",{"$nulls":7},"온라인",null,0,null,"성과관리"]
[null,null,"2021-09-01",null,"본부",{"$nulls":7},"온라인",null,5,null,"연구윤리"]
[null,null,"2021-09-01",null,"본부",{"$nulls":7},"온라인",null,5,null,"기타"]
{"$rows_empty":26}
[null,"점수","평가지침"]
[null,"3점","연구 지원 교육(연구비 집행, 보안관리, 성과관리, 연구윤리, 기타)을 총 5회(각 1회씩 반드시)이상을 실시한 경우 "]
[null,"2점","연구 지원 교육(연구비 집행, 보안관리, 성과관리, 연구윤리, 기타)을 총 4회(항목무관)이상을 실시한 경우 "]
[null,"1점","연구 지원 교육(연구비 집행, 보안관리, 성과관리, 연구윤리, 기타)을 총 3회(항목무관)이상을 실시한 경우 "]
[null,"0점","연구 지원 교육(연구비 집행, 보안관리, 성과관리, 연구윤리, 기타)을 총 2회(항목무관)이하 실시한 경우"]
[]
[null,"② 연구자 우수 교육사례"]
[null,"특성화 구분",null,"추진 계획 및 주요 실적(우수 사례 포함)",{"$nulls":12},"인정여부\n(인정 1, 불인정 0)"]
[null,"기관 특성",null,"작성자 입력 란",{"$nulls":12},1,{"$nulls":4},1]
[null,"연구특성·연구자업무특성",null,"작성자 입력 란",{"$nulls":12},1,{"$nulls":4},0]
[]
[null,"점수","평가지침"]
[null,"2점","2개 특성별 우수사례가 인정된 경우\n\t1) 기관 특성\n\t2) 연구 특성·연구자업무 특성"]
[null,"1점","1개 특성별 우수사례가 인정된 경우"]
[null,"0점","우수사례가 하나도 인정되지 않은 경우"]
[]
[null,"세부평가지표",{"$nulls":9},"배점",null,"자체평가",{"$nulls":7},0,0]
[null,"1-4. ① 연구자에 대한 교육실적",{"$nulls":9},3,null,{"$f":"VLOOKUP(Y195,$V$289:$W$293,2,1)","v":2},{"$nulls":7},3,1]
[null,"1-4. ② 연구자 우수 교육사례",{"$nulls":9},2,null,{"$f":"IF(SUM(Q280:R282)=2,2,IF(SUM(Q280:R282)=1,1,0))","v":2},{"$nulls":7},4,2]
[null,"1-4. 연구자에 대한 교육실적",{"$nulls":9},5,null,{"$f":"SUM(N290:P291)","v":4},{"$nulls":7},5,3]
[{"$nulls":21},100,4]

{"sheet":"2.연구지원 인력의 운영수준","index":3,"n_rows":116,"n_cols":23,"rows_kept":116,"cut":false,"hidden":false,"merged":[[114,1,114,13],[114,14,114,15],[114,16,114,17],[115,1,115,13],[115,14,115,15],[115,16,115,17],[106,2,106,17],[108,1,108,17],[109,2,109,17],[110,2,110,17],[111,2,111,17],[112,2,112,17],[103,2,103,17],[104,2,104,17],[105,2,105,17],[86,16,87,16],[86,17,87,17],[86,18,87,18],[86,7,87,7],[86,8,87,8],[86,9,87,9],[86,10,87,10],[86,11,87,11],[86,12,87,12],[86,2,87,2],[86,3,87,3],[86,4,87,4],[86,5,87,5],[86,6,87,6],[86,13,87,13],[86,14,87,14],[86,15,87,15],[84,1,85,1],[84,2,85,2],[84,3,85,3],[84,4,85,4],[84,5,85,5],[84,6,85,6],[94,1,94,12],[101,1,101,17],[102,2,102,17],[86,1,87,1],[84,16,85,16],[84,17,85,17],[84,18,85,18],[84,7,85,7],[84,8,85,8],[84,9,85,9],[84,10,85,10],[84,11,85,11],[84,12,85,12],[84,13,85,13],[84,14,85,14],[84,15,85,15],[82,16,83,16],[82,17,83,17],[82,18,83,18],[82,7,83,7],[82,8,83,8],[82,9,83,9],[82,10,83,10],[82,11,83,11],[82,12,83,12],[82,1,83,1],[82,2,83,2],[82,3,83,3],[82,4,83,4],[82,5,83,5],[82,6,83,6],[80,13,81,13],[80,14,81,14],[80,15,81,15],[80,1,81,1],[80,2,81,2],[80,3,81,3],[80,4,81,4],[80,5,81,5],[80,6,81,6],[82,13,83,13],[82,14,83,14],[82,15,83,15],[78,9,79,9],[78,10,79,10],[78,11,79,11],[78,12,79,12],[80,16,81,16],[80,17,81,17],[80,18,81,18],[80,7,81,7],[80,8,81,8],[80,9,81,9],[80,10,81,10],[80,11,81,11],[80,12,81,12],[78,1,79,1],[78,2,79,2],[78,3,79,3],[78,4,79,4],[78,5,79,5],[78,6,79,6],[75,18,77,18],[76,3,77,3],[76,4,77,4],[76,5,77,5],[76,6,77,6],[76,7,77,7],[76,8,77,8],[76,9,77,9],[76,10,77,10],[76,12,77,12],[78,13,79,13],[78,14,79,14],[78,15,79,15],[78,16,79,16],[78,17,79,17],[78,18,79,18],[78,7,79,7],[78,8,79,8],[71,1,73,15],[75,1,77,1],[75,2,77,2],[75,3,75,15],[75,16,77,16],[75,17,77,17],[76,13,77,13],[76,14,77,14],[76,15,77,15],[65,1,65,13],[65,14,65,15],[65,16,65,17],[60,2,60,17],[61,2,61,17],[62,2,62,17],[64,1,64,13],[64,14,64,15],[64,16,64,17],[53,2,53,17],[54,2,54,17],[55,2,55,17],[57,1,57,17],[58,2,58,17],[59,2,59,17],[42,16,43,16],[42,17,43,17],[42,18,43,18],[50,1,50,17],[51,2,51,17],[52,2,52,17],[42,10,43,10],[42,11,43,11],[42,12,43,12],[42,13,43,13],[42,14,43,14],[42,15,43,15],[42,1,43,1],[42,2,43,2],[42,3,43,3],[42,4,43,4],[42,5,43,5],[42,6,43,6],[42,7,43,7],[42,8,43,8],[42,9,43,9],[38,16,41,16],[38,17,41,17],[38,18,41,18],[40,4,41,4],[40,5,41,5],[40,6,41,6],[40,7,41,7],[23,2,23,17],[25,1,25,13],[25,14,25,15],[25,16,25,17],[26,1,26,13],[26,14,26,15],[26,16,26,17],[40,15,41,15],[40,8,41,8],[40,10,41,10],[40,11,41,11],[40,12,41,12],[40,13,41,13],[40,14,41,14],[38,1,41,1],[38,2,41,2],[38,3,39,15],[32,1,36,15],[16,16,17,16],[16,17,17,17],[19,2,19,17],[20,2,20,17],[21,2,21,17],[22,2,22,17],[16,10,17,10],[16,11,17,11],[16,12,17,12],[16,13,17,13],[16,14,17,14],[16,15,17,15],[16,1,17,1],[16,2,17,2],[16,3,17,3],[16,4,17,4],[16,5,17,5],[16,6,17,6],[16,7,17,7],[16,8,17,8],[16,9,17,9],[3,1,10,17],[12,1,15,1],[12,2,15,2],[12,3,13,15],[12,16,15,16],[12,17,15,17],[14,4,15,4],[14,5,15,5],[14,6,15,6],[14,7,15,7],[14,15,15,15],[14,8,15,8],[14,10,15,10],[14,11,15,11],[14,12,15,12],[14,13,15,13],[14,14,15,14]]}
[]
[null,"2-1. 연구지원인력의 확보"]
[]
[null,"* 작성시 유의사항\n- 연구지원인력：연구기획, 협약, 정산, 구매, 자산, 검수, 재무･회계, 감사, 연구보안, 기타(성과, 연구지원, 인사총무 등 연구비관리에 필요한 기타 부서)부서에 소속된 \n  정규직원 및 (무기)계약직원(아르바이트생 제외)\n- 2021.12.31일자 기준으로 작성\n- 하기 템플릿에 대하여 행, 열의 삽입 또는 삭제하지 않음\n- 비고 란(36~37행)에는 \"출연연\"과 \"4개과기원/전문연‘ 중에서 기관 유형을 선택하여 반드시 입력 \n- 자체평가 셀에 있는 함수는 수정하지 않음"]
{"$rows_empty":8}
[null,"구 분","전체 \n연구인력\n (A)","연구지원 기능 및 부서별 인원",{"$nulls":12},"연구근접지원인력\n(C)","비율\n(B+C)/\n(A)"]
[]
[null,null,null,"연구","협약","정산","구매","자산","검수","재무･","감사","성과관리활용","연구\n윤리","연구\n보안","기타","계(B)"]
[null,null,null,"기획",{"$nulls":5},"회계"]
[null,"기관명",641,20,15,20,31,42,20,15,5,0,0,0,8,{"$f":"SUM(D17:O18)","v":176},4,{"$f":"IFERROR((P17+Q17)/C17,0)","v":0.28081123244929795}]
[]
[]
[null,"연구비 규모","평가지침"]
[null,"4점","전체 연구인력 대비 연구지원 인력 비율이 30% 이상",{"$nulls":18},0,1]
[null,"3점","전체 연구인력 대비 연구지원 인력 비율이 25% 이상 30% 미만",{"$nulls":18},0.2,2]
[null,"2점","전체 연구인력 대비 연구지원 인력 비율이 20% 이상 25% 미만",{"$nulls":18},0.25,3]
[null,"1점","전체 연구인력 대비 연구지원 인력 비율이 20% 미만",{"$nulls":18},0.3,4]
[{"$nulls":21},1,4]
[null,"세부평가지표",{"$nulls":12},"배점",null,"자체평가"]
[null,"2-1. 연구지원인력의 확보",{"$nulls":12},4,null,{"$f":"VLOOKUP(R17,V21:W25,2,1)","v":3}]
[]
[]
[]
[null,"2-2. 연구비 10억당 연구지원 인력"]
[]
[null,"* 작성시 유의사항\n- 연구지원 기능 및 부서별 인원은 2-1 값을 그대로 불러오기 때문에 입력하지 않음\n- 비고에서 신규 참여 연구기관인 \"4대 과학기술원\" 및 \"전문연\"은 해당 항목을 반드시 선택하고, 그 외에는 출연연등을 선택함"]
[]
[]
[]
[]
[]
[null,"구 분","기관 전체\n연구비 현황(A)\n(단위:천원)","연구지원 기능 및 부서별 인원",{"$nulls":12},"연구근접지원인력\n(C)","비율\n(B+C)\nx10억/\n(A)","비고\n(출연연/\n4대과기원,전문연)"]
[]
[null,null,null,"연구","협약","정산","구매","자산","검수","재무･","감사","성과관리활용","연구\n윤리","연구\n보안","기타","계(B)"]
[null,null,null,"기획",{"$nulls":5},"회계"]
[null,"기관명",267121018,{"$f":"D17","v":20},15,20,31,42,20,15,5,0,0,0,8,{"$f":"SUM(D43:O44)","v":176},{"$f":"Q17","v":4},{"$f":"IFERROR(((P43+Q43)*1000000)/C43,0)","v":0.67385187937551216},"4대과기원/전문연",null,null,"출연연등"]
[{"$nulls":21},"4대과기원/전문연"]
[]
[]
[]
[]
[]
[]
[null,"연구비 10억 당 연구지원 인력"]
[null,"연구비 규모","평가지침"]
[null,"4점","10억에 대한 전체 연구비 연평균 대비 연구지원 1.3명 이상인 경우",{"$nulls":18},0,1]
[null,"3점","10억에 대한 전체 연구비 연평균 대비 연구지원 1.0명 이상 1.3명 이내인 경우",{"$nulls":18},0.7,2]
[null,"2점","10억에 대한 전체 연구비 연평균 대비 연구지원 0.7명 이상 1.0명 이내인 경우",{"$nulls":18},1,3]
[null,"1점","10억에 대한 전체 연구비 연평균 대비 연구지원 0.7명 이내인 경우",{"$nulls":18},1.3,4]
[{"$nulls":21},100,4]
[null,"연구비 10억 당 연구지원 인력 - (신규 참여 연구기관 : 4대 과학기술원, 전문연에 한함)"]
[null,"연구비 규모","평가지침"]
[null,"4점","10억에 대한 전체 연구비 평균 대비 연구지원 1.3명 이상인 경우",{"$nulls":18},0,1]
[null,"3점","10억에 대한 전체 연구비 평균 대비 연구지원 0.9명 이상 1.3명 이내인 경우",{"$nulls":18},0.5,2]
[null,"2점","10억에 대한 전체 연구비 평균 대비 연구지원 0.5명 이상 0.9명 이내인 경우",{"$nulls":18},0.9,3]
[null,"1점","10억에 대한 전체 연구비 평균 대비 연구지원 0.5명 이내인 경우",{"$nulls":18},1.3,4]
[{"$nulls":21},100,4]
[null,"세부평가지표",{"$nulls":12},"배점",null,"자체평가"]
[null,"2-2. 연구비 10억 당 연구지원 인력",{"$nulls":12},4,null,{"$f":"IF(S43=\"출연연등\",VLOOKUP(R43,V53:W57,2,1),VLOOKUP(R43,V60:W64,2,1))","v":2}]
[]
[]
[]
[null,"2-3. 연구지원 인력의 정규직 비중"]
[]
[null,"* 작성시 유의사항\n -   2021.12.31일자 기준으로 작성하되,「2-1 연구지원인력의 확보」에서의 연구지원인력(B+C)과 동일해야함"]
[]
[]
[]
[null,"구 분","전체 \n연구인력\n(A)","연구지원 기능 및 부서별 인원",{"$nulls":12},"연구근접지원인력\n(C)","총계\n(B+C)","비고\n(출연연/\n4대과기원,전문연)"]
[null,null,null,"연구\n기획","협약","정산","구매","자산","검수","재무･\n회계","감사","성과관리","연구\n윤리","연구\n보안","기타","계(B)"]
[{"$nulls":11},"활용"]
[null,"정규직",100,11,13,12,5,5,3,9,5,0,0,0,3,{"$f":"SUM(D79:O80)","v":66},1,{"$f":"P79+Q79","v":67}]
[]
[null,"무기계약직",200,9,2,7,20,0,0,6," ",0,0,0,4,{"$f":"SUM(D81:O82)","v":48},2,{"$f":"P81+Q81","v":50}]
[]
[null,"기간제 계약직",200,null,null,1,6,37,17,{"$nulls":6},{"$f":"SUM(D83:O84)","v":61},1,{"$f":"P83+Q83","v":62}]
[]
[null,"기타",141,{"$nulls":12},{"$f":"SUM(D85:O86)","v":0},null,{"$f":"P85+Q85","v":0}]
[]
[null,"전체직원",{"$f":"SUM(C79:C86)","v":641},{"$f":"SUM(D79:D86)","v":20},15,20,31,42,20,15,5,0,0,0,7,175,4,{"$f":"P87+Q87","v":179},"4대과기원/전문연",null,null,"출연연등"]
[{"$nulls":21},"4대과기원/전문연"]
[]
[null,"검증",{"$f":"C87=C17","v":true},{"$f":"D87=D17","v":true},{"$f":"E87=E17","v":true},true,true,true,true,true,true,true,true,true,false,false,true,{"$f":"R87=(P17+Q17)","v":false}]
[null," * 검증식에서 \"FALSE\"가 나오는 경우 인원수 확인 필요)"]
[]
[]
[]
[null,"【연구지원 인력의 정규직 비율】"]
[]
[]
[{"$nulls":10},{"$f":"IFERROR((R79+R81)/R87,0)","v":0.65363128491620115}]
[]
[]
[]
[null,"【연구지원 인력의 정규직 비율】 "]
[null,"점수","평가지침"]
[null,"3점","전체 연구지원인력 중 정규직 직원이 80% 이상",{"$nulls":18},0,0]
[null,"2점","전체 연구지원인력 중 정규직 직원이 70% 이상 80% 미만",{"$nulls":18},0.6,1]
[null,"1점","전체 연구지원인력 중 정규직 직원이 60% 이상 70% 미만",{"$nulls":18},0.7,2]
[null,"0점","전체 연구지원인력 중 정규직 직원이 60% 미만",{"$nulls":18},0.8,3]
[{"$nulls":21},1,3]
[null,"【연구지원 인력의 정규직 비율】 (신규 참여 연구기관 : 4대 과학기술원, 전문연에 한함)"]
[null,"점수","평가지침"]
[null,"3점","전체 연구지원 인력 중 정규직 직원이 50% 이상",{"$nulls":18},0,1]
[null,"2점","전체 연구지원 인력 중 정규직 직원이 30% 이상 50% 미만",{"$nulls":18},0.3,2]
[null,"1점","전체 연구지원 인력 중 정규직 직원이 30% 미만",{"$nulls":18},0.5,3]
[{"$nulls":21},1,3]
[null,"세부평가지표",{"$nulls":12},"배점",null,"자체평가"]
[null,"2-3. 연구지원 인력의 정규직 비율",{"$nulls":12},3,null,{"$f":"IF(S87=\"출연연등\",VLOOKUP(K98,V104:W108,2,1),VLOOKUP(K98,V111:W114,2,1))","v":3}]

{"sheet":"3.규정개선 및 실행현황","index":4,"n_rows":191,"n_cols":20,"rows_kept":191,"cut":false,"hidden":false,"merged":[[81,1,83,11],[85,1,85,2],[155,1,155,2],[151,1,153,11],[174,3,175,4],[174,5,175,5],[189,1,189,7],[189,8,189,9],[189,10,189,11],[181,1,181,3],[181,4,181,11],[182,1,183,2],[182,4,182,11],[183,4,183,11],[184,1,185,2],[184,4,184,11],[185,4,185,11],[178,1,179,1],[178,3,178,4],[178,6,178,7],[178,8,178,9],[178,10,178,11],[179,3,179,4],[179,6,179,7],[190,1,190,7],[190,8,190,9],[190,10,190,11],[187,1,187,7],[187,8,187,9],[187,10,187,11],[188,1,188,7],[188,8,188,9],[188,10,188,11],[179,8,179,9],[179,10,179,11],[173,1,173,4],[174,1,175,2],[174,6,175,8],[174,9,175,11],[176,1,177,2],[176,6,177,8],[176,9,177,11],[176,3,177,4],[176,5,177,5],[166,1,166,8],[166,9,166,11],[168,2,168,11],[169,2,169,11],[170,2,170,11],[171,2,171,11],[163,1,163,8],[163,9,163,11],[164,1,164,8],[164,9,164,11],[165,1,165,8],[165,9,165,11],[160,1,161,1],[160,2,161,3],[160,4,161,4],[160,5,161,5],[160,6,161,7],[160,8,161,11],[157,1,157,4],[158,1,159,1],[158,2,158,5],[158,6,159,7],[158,8,159,11],[159,2,159,3],[144,1,144,7],[144,8,144,9],[144,10,144,11],[145,1,145,7],[145,8,145,9],[145,10,145,11],[140,2,140,11],[142,1,142,7],[142,8,142,9],[142,10,142,11],[143,1,143,7],[143,8,143,9],[143,10,143,11],[135,1,136,1],[135,2,136,4],[135,5,136,8],[135,9,136,11],[138,2,138,11],[139,2,139,11],[129,2,129,11],[130,2,130,11],[132,1,132,4],[133,1,134,1],[133,2,133,8],[133,9,134,11],[134,2,134,4],[134,5,134,8],[124,1,124,8],[124,9,124,11],[125,1,125,8],[125,9,125,11],[127,2,127,11],[128,2,128,11],[120,1,121,1],[120,2,121,4],[120,5,121,5],[120,6,121,8],[120,9,121,11],[123,1,123,8],[123,9,123,11],[117,1,117,4],[118,1,119,1],[118,2,119,4],[118,5,119,5],[118,6,119,8],[118,9,119,11],[110,1,110,7],[110,8,110,9],[110,10,110,11],[111,1,111,7],[111,8,111,9],[111,10,111,11],[106,2,106,11],[108,1,108,7],[108,8,108,9],[108,10,108,11],[109,1,109,7],[109,8,109,9],[109,10,109,11],[101,1,102,1],[101,2,102,4],[101,5,102,7],[101,8,102,11],[104,2,104,11],[105,2,105,11],[93,2,93,11],[94,2,94,11],[95,2,95,11],[96,2,96,11],[98,1,98,4],[99,1,100,1],[99,2,100,4],[99,5,100,7],[99,8,100,11],[90,1,91,1],[90,2,91,4],[90,5,91,5],[90,6,91,7],[90,8,91,9],[90,10,91,11],[88,1,89,1],[88,2,89,4],[88,5,89,5],[88,6,89,7],[88,8,89,9],[88,10,89,11],[74,1,74,7],[74,8,74,9],[74,10,74,11],[75,1,75,7],[75,8,75,9],[75,10,75,11],[70,2,70,11],[72,1,72,7],[72,8,72,9],[72,10,72,11],[73,1,73,7],[73,8,73,9],[73,10,73,11],[65,1,66,1],[65,2,66,4],[65,5,66,7],[65,8,66,11],[68,2,68,11],[69,2,69,11],[60,2,60,11],[62,1,62,4],[63,1,64,1],[63,2,64,4],[63,5,64,7],[63,8,64,11],[54,1,54,8],[54,9,54,11],[56,2,56,11],[57,2,57,11],[58,2,58,11],[59,2,59,11],[51,1,51,8],[51,9,51,11],[52,1,52,8],[52,9,52,11],[53,1,53,8],[53,9,53,11],[47,1,48,1],[47,2,48,4],[47,5,48,5],[47,6,48,8],[47,9,48,11],[50,1,50,8],[50,9,50,11],[38,1,38,7],[38,8,38,9],[38,10,38,11],[44,1,44,4],[45,1,46,1],[45,2,46,4],[45,5,46,5],[45,6,46,8],[45,9,46,11],[36,1,36,7],[36,8,36,9],[36,10,36,11],[37,1,37,7],[37,8,37,9],[37,10,37,11],[31,2,31,11],[32,2,32,11],[33,2,33,11],[35,1,35,7],[35,8,35,9],[35,10,35,11],[27,1,28,1],[27,2,28,4],[27,5,28,5],[27,6,28,8],[27,9,28,11],[30,2,30,11],[21,2,21,11],[24,1,24,4],[25,1,26,1],[25,2,26,4],[25,5,26,5],[25,6,26,8],[25,9,26,11],[17,1,17,8],[17,9,17,11],[19,2,19,11],[20,2,20,11],[12,1,13,1],[12,2,13,4],[12,5,13,5],[12,6,13,8],[12,9,13,11],[15,1,15,8],[15,9,15,11],[3,1,7,11],[9,1,9,4],[10,1,11,1],[10,2,11,4],[10,5,11,5],[10,6,11,8],[10,9,11,11],[16,1,16,8],[16,9,16,11]]}
[]
[null,"3-1. 국내 출장운임 관련 내부규정 및 정액지급 여부(출연연만 입력 대상이고 특정연 및 전문연은 미해당)"]
[]
[null,"* 작성시 유의사항\n- 기관에 해당사항이 없는 경우, ① \"O/X\"를 선택하는 항목에는 \"X\"를 표시하고, ② \"O/X\"를 선택하지 않는 항목에는 반드시 해당 셀을 \"빈 칸\"으로 유지함 \n- 하기 템플릿에 대하여 행, 열의 삽입 또는 삭제하지 않음\n- 자체평가 셀에 있는 함수는 수정하지 않음"]
[]
[]
[]
[]
[]
[null,"1) 국내 출장운임 정액 지급 내부규정"]
[null,"구분","내부규정",null,null,"조항","주요내용",null,null,"안내 여부"]
[]
[null,"기관명","작성자 입력 란",null,null,"작성자 입력 란","작성자 입력 란",null,null,"작성자 입력 란"]
[]
[]
[null,"평가항목",{"$nulls":7},"해당 여부(O/X)"]
[null,"1)국내 출장 운임 규정 중 정액자금규정 여부",{"$nulls":7},"O",{"$nulls":5},"O"]
[null,"2)기관내 이를 안내 여부",{"$nulls":7},"O",{"$nulls":5},"X"]
[]
[null,"점수","평가지침"]
[null,"1점","2가지 모두 충족한 경우\n           1)국내 출장 운임 규정 중 정액자금규정이 있고\n           2)기관내 이를 안내한 경우"]
[null,"0점","미충족하는 경우"]
[]
[]
[null,"2) 국내 출장운임 정액지급 여부"]
[null,"구분","전체국내출장운임비(억원)(A)",null,null,"실비정산\n국내출장운임비 (억원)","정액자금 국내출장\n운임비(억원) (B)",null,null,"비율(B/A)"]
[]
[null,"기관명",{"$f":"SUM(F28:I29)","v":26.986999999999998},null,null,10,16.986999999999998,null,null,{"$f":"IFERROR(G28/C28,0)","v":0.62945121725275133}]
[]
[]
[null,"점수","평가지침"]
[null,"2점","정액자금 국내출장비 비율이 50% 이상인 경우"]
[null,"1점","정액자금 국내출장비 비율이 30% 이상 50% 미만인 경우"]
[null,"0점","정액자금 국내출장비 비율이 30% 미만인 경우"]
[]
[null,"세부평가지표",{"$nulls":6},"배점",null,"자체평가"]
[null,"3-1.1) 국내 출장운임 정액 지급 내부규정",{"$nulls":6},1,null,{"$f":"IF(J17=\"O\",IF(J18=\"O\",1,0),0)","v":1},{"$nulls":4},0,0]
[null,"3-1. 2) 국내 출장운임 정액지급 여부",{"$nulls":6},2,null,{"$f":"VLOOKUP(J28,$P$37:$Q$40,2,1)","v":2},{"$nulls":4},0.3,1]
[null,"3-1. 국내 출장운임 관련 내부규정 및 정액지급 여부(출연연만 입력 대상이고 특정연 및 전문연은 미해당)",{"$nulls":6},3,null,{"$f":"SUM(K37:L38)","v":3},{"$nulls":4},0.5,2]
[{"$nulls":15},1,2]
[]
[]
[null,"3-2.회의비 집행 증명 간소화 규정 및 현황"]
[]
[null,"1)회의비 집행 증명 간소화 규정"]
[null,"구분","내부규정",null,null,"조항","주요내용",null,null,"안내 여부"]
[]
[null,"기관명","작성자 입력 란",null,null,"작성자 입력 란","작성자 입력 란",null,null,"작성자 입력 란",{"$nulls":5},"O"]
[{"$nulls":15},"X"]
[]
[null,"평가항목",{"$nulls":7},"해당 여부(O/X)"]
[null,"1)내부품의서 또는 회의록 하나만 제출규정 여부",{"$nulls":7},"O",null,null,"O",null,null,"O",{"$f":"COUNTIF($J$52:$L$55,P52)","v":2}]
[null,"\t2)참석자 서명 날인 폐지",{"$nulls":7},"X"]
[null,"\t3)10만 원 이하 회의비 영수증 + 증빙자료 제출, 단 회의의 목적, 일시, 장소, 내용, 참석자 명단이 기재된 증명자료로 대신할 수 있음",{"$nulls":7},"X"]
[null,"\t4)(내부/인트라넷) 홈페이지 등에 안내 ",{"$nulls":7},"O"]
[]
[null,"점수","평가지침",{"$nulls":15},0,0]
[null,"3점","4가지 항목 모두 충족한 경우 :\n\t1)내부품의서 또는 회의록 하나만 제출\n\t2)참석자 서명 날인 폐지\n\t3)10만 원 이하 회의비 영수증 + 증빙자료 제출, 단 회의의 목적, 일시, 장소, 내용, 참석자 명단이 기재된 증명자료로 대신할 수 있음\n\t4)(내부/인트라넷) 홈페이지 등에 안내 ",{"$nulls":15},1,0]
[null,"2점","3가지 항목만 충족한 경우",{"$nulls":15},2,1]
[null,"1점","2가지 항목만 충족한 경우",{"$nulls":15},3,2]
[null,"0점","1가지 항목 이하 충족한 경우",{"$nulls":15},4,3]
[]
[null,"2)회의비 집행 증명 간소화 현황"]
[null,"구분","전체 회의비 증빙 중 간소화 \n문서기준 이행 여부(O/X)",null,null,"전체 회의비 증빙 중 참석자 서명 \n날인 폐지 이행 여부(O/X)",null,null,"전체 회의비 증빙 중 10만 원 이하 \n영수증만을 제출한 이행 여부(O/X)"]
[]
[null,"기관명","O",null,null,"O",null,null,"O",null,null,null,"O",null,null,"O"]
[{"$nulls":12},"X",null,null,"X"]
[]
[null,"점수","평가지침"]
[null,"1점","3가지 항목이 이행된 경우"]
[null,"0점","3가지 항목 미만으로 이행된 경우"]
[]
[null,"세부평가지표",{"$nulls":6},"배점",null,"자체평가"]
[null,"3-2. 1)회의비 집행 증명 간소화 규정",{"$nulls":6},3,null,{"$f":"VLOOKUP(Q52,$S$57:$T$62,2,1)","v":1}]
[null,"3-2. 2)회의비 집행 증명 간소화 현황",{"$nulls":6},1,null,{"$f":"IF(C66=\"O\",IF(F66=\"O\",IF(I66=\"O\",1,0),0),0)","v":1}]
[null,"3-2.회의비 집행 증명 간소화 규정 및 현황",{"$nulls":6},4,null,{"$f":"SUM(K74:L75)","v":2}]
[]
[]
[]
[null,"3-3. 연구근접지원인력 필요경비 비용집행 규정 및 실적"]
[]
[null,"* 작성시 유의사항\n- 아래의 연구근접지원인력 해당 여부를 먼저 작성"]
[]
[]
[]
[null,"연구근접지원인력 해당여부\n(O/X 중 선택)",null,"O"]
[]
[null,"1)직접연구지원인력 중 연구근접지원인력 회의비 및 출장비 비용집행규정"]
[null,"구분","내부규정",null,null,"조항","주요내용",null,"안내 여부",null,"근접지원인력 수"]
[]
[null,"기관명","X",null,null,"작성자 입력 란","작성자 입력 란",null,"O",null,0,{"$nulls":4},"O"]
[{"$nulls":15},"X"]
[]
[null,"점수","평가지침"]
[null,"2점","2가지 항목 모두 충족한 경우\n    1)연구근접지원인력 필요경비(회의비 및 출장비) 비용집행 관련 규정이 있고\n    2)기관내 이를 안내한 경우"]
[null,"1점","1가지 항목만 충족한 경우"]
[null,"0점","1가지 항목도 충족하지 못한 경우"]
[]
[null,"2)연구근접지원인력 비용집행실적"]
[null,"구분","(인건비 제외한) 필요경비 지급 건수 ",null,null,"필요경비지급금액",null,null,"비고"]
[]
[null,"기관명",1,null,null,1]
[]
[]
[null,"점수","평가지침"]
[null,"1점","2가지 항목 모두 충족한 경우\n\t1)연구근접지원인력 필요경비 지급 건수가 있는 경우\n\t2)연구근접지원인력 필요경비 지급 금액이 있는 경우"]
[null,"0점","1가지 항목이하로 충족한 경우"]
[]
[null,"세부평가지표",{"$nulls":6},"배점",null,"자체평가"]
[null,"3-3. 1)직접연구지원인력 중 연구근접지원인력 회의비 및 출장비 비용집행 규정",{"$nulls":6},2,null,{"$f":"IF(C91=\"O\",IF(I91=\"O\",2,IF(I91=\"X\",1,0)))+IF(C91=\"X\",IF(I91=\"O\",1,0))","v":1}]
[null,"3-3. 2)연구근접지원인력 비용집행실적",{"$nulls":6},1,null,{"$f":"IF(C102>0,IF(F102>0,1,0),0)","v":1}]
[null,"3-3. 연구근접지원인력 필요경비 비용집행 규정 및 실적",{"$nulls":6},3,null,{"$f":"SUM(K110:L111)","v":2}]
[]
[]
[]
[null,"3-4. 논문게재료 집행유연성 규정 및 현황"]
[]
[null,"1)논문게재료 집행유연성 규정"]
[null,"구분","내부규정",null,null,"조항","주요내용",null,null,"안내 여부"]
[]
[null,"기관명","작성자 입력 란",null,null,"작성자 입력 란","작성자 입력 란",null,null,"작성자 입력 란"]
[]
[]
[null,"평가항목",{"$nulls":7},"해당 여부(O/X)"]
[null,"간접비에서 논문게재료 지급가능규정 있는 경우",{"$nulls":7},"X",{"$nulls":5},"O",{"$f":"IF(J125=\"O\",1,0)","v":0}]
[null,"직접비에서 논문게재료 지급가능규정 있는 경우",{"$nulls":7},"O",{"$nulls":5},"X",{"$f":"IF(J126=\"O\",1,0)","v":1}]
[{"$nulls":15},"합계",{"$f":"SUM(Q125:Q126)","v":1}]
[null,"점수","평가지침"]
[null,"2점","2가지를 충족하는 경우\n간접비에서 논문게재료 지급가능규정 있는 경우\n직접비에서 논문게재료 지급가능규정 있는 경우"]
[null,"1점","1가지 항목 이하로 충족한 경우"]
[null,"0점","1가지 항목도 충족하지 못한 경우"]
[]
[null,"2)논문게재료 집행유연성 실적"]
[null,"구분","논문게재료 지원금",{"$nulls":6},"합계"]
[null,null,"간접비 지원 건수(개)",null,null,"간접비 지원금액(천원)"]
[null,"기관명",1,null,null,500]
[]
[]
[null,"점수","평가지침"]
[null,"1점","간접비에서 논문게재료 지원금액과 건수가 모두 있는 경우"]
[null,"0점","간접비에서 논문게재료 지원금액과 건수가 없는 경우"]
[]
[null,"세부평가지표",{"$nulls":6},"배점",null,"자체평가"]
[null,"3-4. 1)논문게재료 집행유연성 규정",{"$nulls":6},2,null,{"$f":"IF(Q127=2,2,IF(Q127=1,1,0))","v":1}]
[null,"3-4. 2)논문게재료 집행유연성 실적",{"$nulls":6},1,null,{"$f":"IF(C136>0,IF(F136>0,1,0),0)","v":1}]
[null,"3-4. 논문게재료 집행유연성 규정 및 현황",{"$nulls":6},2,null,{"$f":"SUM(K144:L145)","v":2}]
[]
[]
[]
[null,"3-5. 학생연수자 근로계약 및 직무발명보상금 지급 여부"]
[]
[null,"* 작성시 유의사항\n- 아래의 학생연수자 해당 여부를 먼저 작성"]
[]
[]
[]
[null,"학생연수자 해당여부\n(O/X 중 선택)",null,"O"]
[]
[null,"1)학생연수자 근로계약 여부"]
[null,"구분","1) 근로계약 기준규정",null,null,null,"2) 근로계약 기준기관 \n시스템 안내 여부",null,"3) 인건비 지급내역 확인 시스템"]
[null,null,"내부 규정명",null,"조항","조항 내용"]
[null,"학생연수자 \n근로계약\n체결기준 및 절차","작성자 입력",null,"작성자 입력","작성자 입력","O",null,"O",{"$nulls":7},"O"]
[{"$nulls":16},"X"]
[]
[null,"평가항목",{"$nulls":7},"해당 여부(O/X)"]
[null,"1) 학생연수자 근로계약 기준 관련 규정 확보",{"$nulls":7},"X",null,null,"O",null,null,"O",{"$f":"COUNTIF($J$165:$L$167,P165)","v":2}]
[null,"2) 학생연수자 근로계약 기준 기관 시스템 안내 여부",{"$nulls":7},{"$f":"G161","v":"O"}]
[null,"3) 학생연수자 본인의 인건비 지급 내역을 확인할 수 있는 시스템 구축 여부",{"$nulls":7},{"$f":"I161","v":"O"}]
[]
[null,"점수","평가지침"]
[null,"2점","3가지 항목이 모두 충족하는 경우, \n  1) 학생연수자 근로계약 기준 관련 규정 확보, \n  2) 학생연수자 근로계약 기준 기관 시스템 안내 여부, \n  3) 학생연수자 본인의 인건비 지급 내역을 확인할 수 있는 시스템 구축 여부",{"$nulls":15},0,0]
[null,"1점","2가지 항목만 충족하는 경우",{"$nulls":15},1,0]
[null,"0점","1가지 항목만 충족하는 경우",{"$nulls":15},2,1]
[{"$nulls":18},3,2]
[null,"2)학생연수자 직무발명보상금 지급 여부"]
[null,"구분",null,"내부규정명",null,"내부규정 여부\n(O/X 선택)","조항",null,null,"조항내용"]
[]
[null,"학생연수자 직무발명보상금 \n지급 관련 절차 및 제도 현황",null,"입력",null,"O","작성자 입력",null,null,"작성자 입력"]
[]
[null,"학생연수자 \n직무발명보상금 \n지급 내역","기간","학생연수자 보상금 대상인원수(명)(A)",null,"학생연수자 보상금\n지급인원수(명)\n(B)","지급비율(%)\n(C=B/A*100)",null,"전체 지급 금액(원)\n(D)",null,"1인당 평균 \n지급 금액(원)\n(E=D/B) "]
[null,null,"최근 평가기간",100,null,80,{"$f":"IFERROR(F180/D180*100,0)","v":80},null,100000000,null,{"$f":"ROUND(I180/F180,0)","v":1250000}]
[]
[null,"점수",null,null,"평가지침"]
[null,"보상금 지급 제도 및 절차(1점)",null,"1점","학생연수자 기여율에 따라 보상금을 지급하는 규정 여부"]
[null,null,null,"0점","규정 미 확보한 경우"]
[null,"보상금 지급 내역 현황(1점)",null,"1점","기술료 보상 지급 대상수 인원 대비 지급된 학생연수자 수의 비율이 80% 이상인 경우"]
[null,null,null,"0점","기술료 보상 지급 대상수 인원 대비 지급된 학생연수자 수의 비율이 80% 미만인 경우"]
[]
[null,"세부평가지표",{"$nulls":6},"배점",null,"자체평가"]
[null,"3-5. 1)학생연수자 근로계약 여부",{"$nulls":6},2,null,{"$f":"VLOOKUP(Q165,S170:T173,2,1)","v":1}]
[null,"3-5. 2)학생연수자 직무발명보상금 지급 여부",{"$nulls":6},2,null,{"$f":"IF(F177=\"O\",1)+IF(G180>=80,1,0)","v":2}]
[null,"3-5. 학생연수자 근로계약 및 직무발명보상금 지급 여부",{"$nulls":6},4,null,{"$f":"SUM(K189:L190)","v":3}]

{"sheet":"4.기관연구지원 시스템구축 및 운영","index":5,"n_rows":106,"n_cols":18,"rows_kept":106,"cut":false,"hidden":false,"merged":[[104,1,104,7],[104,8,104,9],[104,10,104,11],[105,1,105,7],[105,8,105,9],[105,10,105,11],[97,3,97,11],[98,1,100,1],[98,3,98,11],[99,3,99,11],[100,3,100,11],[101,1,102,1],[101,3,101,11],[102,3,102,11],[92,2,92,5],[92,6,92,8],[92,9,92,11],[94,1,94,8],[94,9,94,11],[95,1,95,8],[95,9,95,11],[89,1,89,5],[89,6,89,8],[89,9,89,11],[90,1,92,1],[90,2,90,5],[90,6,90,8],[90,9,90,11],[91,2,91,5],[91,6,91,8],[91,9,91,11],[82,1,82,7],[82,8,82,9],[82,10,82,11],[83,1,83,7],[83,8,83,9],[83,10,83,11],[76,3,76,11],[77,1,80,1],[77,3,77,11],[78,3,78,11],[79,3,79,11],[80,3,80,11],[73,1,73,3],[73,4,73,5],[73,6,73,8],[73,9,73,11],[74,1,74,3],[74,4,74,5],[74,6,74,8],[74,9,74,11],[69,1,69,5],[71,1,72,3],[71,4,71,11],[72,4,72,5],[72,6,72,8],[72,9,72,11],[64,1,64,7],[64,8,64,9],[64,10,64,11],[65,1,65,7],[65,8,65,9],[65,10,65,11],[62,1,62,7],[62,8,62,9],[62,10,62,11],[63,1,63,7],[63,8,63,9],[63,10,63,11],[55,1,55,3],[57,3,57,11],[58,1,60,1],[58,3,58,11],[59,3,59,11],[60,3,60,11],[53,1,53,3],[54,1,54,3],[53,4,53,5],[54,4,54,5],[55,4,55,5],[53,8,53,11],[54,8,54,11],[55,8,55,11],[53,6,53,7],[54,6,54,7],[55,6,55,7],[51,1,51,3],[52,1,52,3],[41,1,41,3],[41,4,41,7],[41,8,41,11],[42,1,42,3],[44,3,44,11],[45,1,48,1],[45,3,45,11],[46,3,46,11],[47,3,47,11],[48,3,48,11],[51,4,51,5],[52,4,52,5],[51,8,51,11],[52,8,52,11],[51,6,51,7],[52,6,52,7],[39,1,39,3],[39,4,39,7],[39,8,39,11],[40,1,40,3],[40,4,40,7],[40,8,40,11],[37,1,37,3],[37,4,37,7],[37,8,37,11],[38,1,38,3],[38,4,38,7],[38,8,38,11],[28,1,28,7],[28,8,28,9],[28,10,28,11],[36,1,36,3],[36,4,36,7],[36,8,36,11],[22,2,22,11],[23,2,23,11],[24,2,24,11],[25,2,25,11],[27,1,27,7],[27,8,27,9],[27,10,27,11],[17,1,17,8],[17,9,17,11],[18,1,18,8],[18,9,18,11],[20,2,20,11],[21,2,21,11],[12,9,12,11],[14,1,14,8],[14,9,14,11],[15,1,15,8],[15,9,15,11],[16,1,16,8],[16,9,16,11],[3,1,8,11],[10,1,10,2],[10,3,10,5],[10,6,10,8],[10,9,10,11],[11,1,12,2],[11,3,12,5],[11,6,11,8],[11,9,11,11],[12,6,12,8]]}
[]
[null,"4-1. 독립적 기관연구지원시스템 구축･운영 "]
[]
[null,"* 작성시 유의사항\n- 기관에 해당사항이 없는 경우, ① \"O/X\"를 선택하는 항목에는 \"X\"를 표시하고, ② \"O/X\"를 선택하지 않는 항목에는 반드시 해당 셀을 \"빈 칸\"으로 유지함\n- 하기 템플릿에 대하여 행, 열의 삽입 또는 삭제하지 않음\n- 자체평가 셀에 있는 함수는 수정하지 않음"]
[]
[]
[]
[]
[]
[]
[null,"독립적 연구지원시스템 구축",null,"연구지원 전담조직 내 구축 ",null,null,"연구지원시스템 구축연도",null,null,"연구지원시스템 주요 구성 "]
[null,"O",null,"O",null,null,"(초기개발)2021.01.01",null,null,"작성자 입력"]
[{"$nulls":6},"(추가개발) ~ 현재",null,null,"작성자 입력"]
[]
[null,"평가항목",{"$nulls":7},"해당 여부(O/X)"]
[null,"1) 독립적 기관연구지원시스템이 구축된 경우",{"$nulls":7},"O",{"$nulls":5},"O"]
[null,"2) 연구지원 전담조직내 구축된 경우(증빙 : 전담부서내 시스템 구축 화면)",{"$nulls":7},"X",{"$nulls":5},"X"]
[null,"3) 시스템 구축 연도가 평가기간 이전으로 구축 후 운영되는 경우(증빙 : 최근 시스템 구축 결재문서 또는 계약서 등)",{"$nulls":7},"X",{"$nulls":5},"집계"]
[null,"4) 세부 시스템 구성 내용이 구체적으로 기재된 경우(증빙 : 연구지원시스템 구성도, 개선내역 등)",{"$nulls":7},"O",{"$nulls":5},"O",{"$f":"COUNTIF($J$16:$L$19,P19)","v":2}]
[]
[null,"점수","평가지침",{"$nulls":12},"점수기준"]
[null,"4점","4가지 항목이 모두 충족된 경우",{"$nulls":12},0,0]
[null,"3점","3가지 항목만이 충족된 경우",{"$nulls":12},1,1]
[null,"2점","2가지 항목만이 충족된 경우 ",{"$nulls":12},2,2]
[null,"1점","1가지 항목만이 충족된 경우",{"$nulls":12},3,3]
[null,"0점","1가지 항목도 충족되지 못한 경우",{"$nulls":12},4,4]
[]
[null,"세부평가지표",{"$nulls":6},"배점",null,"자체평가"]
[null,"4-1. 독립적 기관연구지원시스템 구축･운영 ",{"$nulls":6},4,null,{"$f":"VLOOKUP(Q19,$P$22:$Q$27,2,1)","v":2}]
[]
[]
[]
[null,"4-2. 기관연구지원시스템 전산화 운영수준 및 범위"]
[]
[null,"① 기관연구지원시스템 전산화 운영수준"]
[]
[null,"구분",null,null,"운영 수준",null,null,null,"비고"]
[null,"연구 정보의 전산화 관리",null,null,"X",{"$nulls":10},"O"]
[null,"기관연구지원시스템에 대한 보안관리",null,null,"O",null,null,null,"자체 기관연구지원시스템보안관리대책(계획서) + 증빙 ",{"$nulls":6},"X"]
[null,"부서 간 연구 정보 연계",null,null,"O",{"$nulls":10},"집계"]
[null,"연구 데이터 검색",null,null,"O",{"$nulls":10},"O",{"$f":"COUNTIF($E$38:$H$42,P41)","v":4}]
[null,"종합적 통계 제공",null,null,"O"]
[null," * 2021.12.31.일자 기준으로 작성"]
[]
[null,"구분","점수","평가지침",{"$nulls":11},"점수기준"]
[null,"전산화 \n운영수준\n(3점)","3점","5가지 항목이 모두 충족되는 경우\n① 연구 정보의 전산화 관리, ② 기관연구지원시스템에 대한 보안관리, ③ 부서 간 연구 정보 연계, ④ 연구 데이터 검색, ⑤ 종합적 통계 제공(출력 및 엑셀DB변환)",{"$nulls":11},0,0]
[null,null,"2점","4가지 항목만이 충족되는 경우",{"$nulls":11},2,0]
[null,null,"1점","3가지 항목이 충족되는 경우",{"$nulls":11},3,1]
[null,null,"0점","2가지 이하 항목이 충족되는 경우",{"$nulls":11},4,2]
[{"$nulls":15},5,3]
[null,"② 기관연구지원시스템 전산화 범위"]
[null,"구분",null,null,"전산화 구축연도",null,"전산화 구축 여부",null,"전산화 구성",{"$nulls":8},"집계"]
[null,"예산･정산 ",null,null,"1998년\n(2020년 재구축)",null,"O",null,"작성자 입력",{"$nulls":6},"O","O",{"$f":"COUNTIF(G53:H56,Q53)","v":4}]
[null,"구매･계약･자산･검수 ",null,null,"2000년",null,"O",null,"작성자 입력",{"$nulls":6},"X"]
[null,"재무･회계･세무",{"$nulls":4},"O",null,"작성자 입력"]
[null,"연구 성과관리",null,null," ",null,"O",null,"작성자 입력"]
[]
[null,"구분","점수","평가지침",{"$nulls":11},"점수기준"]
[null,"전산화 범위\n(2점)","2점","전산화가 4가지 구분이 모두 구축 되어 있는 경우\n①예산･정산 ②구매･계약･자산･검수 ③재무･회계･세무 ④ 성과 시스템",{"$nulls":11},0,0]
[null,null,"1점","전산화가 3가지 구분만 구축 되어 있는 경우",{"$nulls":11},3,1]
[null,null,"0점","전산화가 2가지 이하 구분만 구축 되어 있는 경우",{"$nulls":11},4,2]
[]
[null,"세부평가지표",{"$nulls":6},"배점",null,"자체평가"]
[null,"4-2. ① 기관연구지원시스템 전산화 운영수준",{"$nulls":6},3,null,{"$f":"VLOOKUP(Q41,$P$46:$Q$51,2,1)","v":2}]
[null,"4-2. ② 기관연구지원시스템 전산화 범위",{"$nulls":6},2,null,{"$f":"VLOOKUP(R53,$P$59:$Q$61,2,1)","v":2}]
[null,"4-2. 기관연구지원시스템 전산화 운영수준 및 범위",{"$nulls":6},5,null,{"$f":"SUM(K64:L65)","v":4}]
[]
[]
[]
[null,"4-3. 기관연구지원시스템 유지･보수 운영수준"]
[]
[null,"구분",null,null,"유지･보수(단위: 천원)"]
[{"$nulls":4},"예산(A)",null,"사용액(B)",null,null,"집행비율(B/A)"]
[null,"최근 2년 전(2020.1.1 ~ 2020.12.31)",null,null,1881917484,null,1345366541,null,null,{"$f":"IFERROR(G74/E74,0)","v":0.71489135545966376}]
[null,"최근 1년 전(2021.1.1 ~ 2021.12.31)",null,null,833430260,null,185432654,null,null,{"$f":"IFERROR(G75/E75,0)","v":0.22249330615857407}]
[]
[null,"구분","점수","평가지침",{"$nulls":11},"집계"]
[null,"예산 \n운영수준 \n(3점)","3점","2개년 모두 2가지 항목이 충족된 경우\n①운영･유지･보수 예산 편성실적과 집행실적이 모두 있음\n②운영･유지･보수 예산 집행 비율이 모두 80%이상인 경우 ",{"$nulls":11},{"$f":"IF(E74>0,1,0)+IF(E75>0,1,0)","v":2},{"$f":"IF(G74>0,1,0)+IF(G75>0,1,0)","v":2},{"$f":"IF(P78+Q78=4,\"O\",\"X\")","v":"O"}]
[null,null,"2점","2개년 모두 2가지 항목이 충족된 경우\n①운영･유지･보수 예산 편성실적과 집행실적이 모두 있음\n②운영･유지･보수 예산 집행 비율이 1개년만 80% 이상인 경우 "]
[null,null,"1점","2개년 모두 2가지 항목이 충족된 경우\n①운영･유지･보수 예산 편성실적과 집행실적이 모두 있음\n②운영･유지･보수 예산 집행 비율이 2개년 모두 80% 미만인 경우 "]
[null,null,"0점","2개년 중 운영･유지･보수 예산 편성실적과 집행실적 중 하나라도 없는 경우 "]
[]
[null,"세부평가지표",{"$nulls":6},"배점",null,"자체평가"]
[null,"4-3. 기관연구지원시스템 유지･보수 운영수준",{"$nulls":6},3,null,{"$f":"IF(R78=\"O\",IF(J74>=80%,IF(J75>=80%,3,2),(IF(J75>=80%,2,1))),0)","v":1}]
[]
[]
[]
[null,"4-4. 연구비통합관리시스템의 연동성"]
[]
[null,"구분",{"$nulls":4},"시스템 연동성 확보 및 \n관리･운영 수준\n(해당 연구과제 수행하지 않는 \n경우에도 \"O\"를 선택)",null,null,"비고\n(해당 연구과제 수행하지 않는\n경우에는 해당내용 적시) "]
[null,"연구비 통합 \n관리시스템","통합Ezbaro와 기관연구지원시스템과의 \n연동 여부",null,null,null,"O",null,null,"작성자 입력",{"$nulls":5},"O"]
[null,null,"통합RCMS와 기관연구지원시스템과의 \n연동 여부",null,null,null,"O",null,null,"작성자 입력",{"$nulls":5},"X"]
[null,null,"통합Ezbaro시스템의 연구비 집행정보 \n입력기한(D+5일) 준수 여부",{"$nulls":6},"연구기관은 미작성\n(연구재단과 협의하여 \n자체 조사평가 예정임)",{"$nulls":5},"점수(연동 여부)"]
[{"$nulls":15},{"$f":"IF(G91=\"O\",IF(G92=\"O\",2,1),IF(G92=\"O\",1,0))","v":2}]
[null,"평가항목",{"$nulls":7},"준수비율(%)\n(연구기관에서 미작성)"]
[null,"연구비 집행건수 대비 준수비율",{"$nulls":7},0.9,{"$nulls":5},"점수(준수비율)"]
[{"$nulls":15},{"$f":"IFERROR(IF(J96>=0.9,1,0),0)","v":1}]
[null,"구분","점수","평가지침"]
[null,"연동성 확보 \n수준(2점)","2점","연구비 통합관리시스템 2개와 모두 연동성을 가진 경우"]
[null,null,"1점","연구비 통합관리시스템 1개와 연동성을 가진 경우"]
[null,null,"0점","연구비 통합관리시스템과 연동성을 가지지 않는 경우 "]
[null,"입력기한 준수여부(1점)","1점","집행건수 대비 준수비율 90% 이상 "]
[null,null,"0점","집행건수 대비 준수비율 90% 미만 "]
[]
[null,"세부평가지표",{"$nulls":6},"배점",null,"자체평가"]
[null,"4-4. 연구비통합관리시스템의 연동성",{"$nulls":6},3,null,{"$f":"P94+P97","v":3}]

{"sheet":"5. 연구윤리관리의 적절성","index":6,"n_rows":62,"n_cols":19,"rows_kept":62,"cut":false,"hidden":false,"merged":[[15,9,15,11],[49,4,49,8],[49,10,49,13],[12,1,12,8],[12,9,12,11],[13,1,13,8],[13,9,13,11],[14,1,14,8],[14,9,14,11],[46,1,50,3],[46,4,46,8],[46,10,46,13],[47,4,47,8],[47,10,47,13],[48,4,48,8],[48,10,48,13],[61,1,61,8],[61,9,61,10],[61,11,61,12],[56,2,56,12],[58,2,58,12],[60,1,60,8],[60,9,60,10],[60,11,60,12],[57,2,57,12],[50,4,50,8],[50,10,50,13],[51,1,51,5],[53,2,53,12],[54,2,54,12],[55,2,55,12],[39,1,45,3],[39,4,39,8],[39,10,39,13],[40,4,40,8],[40,10,40,13],[41,4,41,8],[41,10,41,13],[42,4,42,8],[42,10,42,13],[43,4,43,8],[43,10,43,13],[44,4,44,8],[44,10,44,13],[45,4,45,8],[45,10,45,13],[32,1,32,8],[32,9,32,10],[32,11,32,12],[38,1,38,3],[38,4,38,8],[38,10,38,13],[30,1,30,8],[30,9,30,10],[30,11,30,12],[31,1,31,8],[31,9,31,10],[31,11,31,12],[24,2,24,12],[25,2,25,12],[26,2,26,12],[27,2,27,12],[29,1,29,8],[29,9,29,10],[29,11,29,12],[23,1,23,12],[3,1,7,13],[9,1,9,3],[9,4,9,6],[9,7,9,9],[9,10,9,12],[10,1,10,3],[10,4,10,6],[10,7,10,9],[10,10,10,12],[17,1,17,12],[18,2,18,12],[19,2,19,12],[20,2,20,12],[21,2,21,12],[15,1,15,8]]}
[]
[null,"5-1. 제재 통보 건수 및 연구비환수 금액"]
[]
[null,"* 작성시 유의사항\n- 해당사항이 없는 경우 반드시 해당 셀을 \"빈 칸\"으로 유지할 것\n- 하기 템플릿에 대하여 행, 열의 삽입 또는 삭제하지 않음\n- 자체평가 셀에 있는 함수는 수정하지 않음"]
[]
[]
[]
[]
[]
[null,"구분",null,null,"참여제한 통보건수",null,null,"제재부가금 \n처분 통보 건수",null,null,"제재 사유와 관련된 \n연구비환수 금액(단위: 천원)"]
[null,"제재 건수 및 연구비환수 금액",null,null,0,null,null,2,null,null,1000]
[]
[null,"평가항목",{"$nulls":7},"해당 여부(O/X)",{"$nulls":8},"집계"]
[null,"평가기간 참여제한 통보 건수가 있는 경우",{"$nulls":7},"X",{"$nulls":6},"O","O",{"$f":"COUNTIF(J14:L16,R14)","v":2}]
[null,"제재부가금 처분 통보 건수가 있는 경우",{"$nulls":7},"O",{"$nulls":6},"X"]
[null,"제재 사유와 관련된 연구비환수 금액이 있는 경우",{"$nulls":7},"O"]
[]
[null,"1)【제재처분(참여제한, 제재부가금) 통보건수 및 제재 사유와 관련된 연구비환수 금액 현황】"]
[null,"점수","평가지침",{"$nulls":13},"점수기준"]
[null,"-2점","평가기간 참여제한 통보 건수, 제재부가금 처분 통보 건수, 제재 사유와 관련된 연구비환수 금액이 모두 있는 경우",{"$nulls":13},0,0]
[null,"-1점","평가기간 참여제한 통보 건수, 제재부가금 처분 통보 건수, 제재 사유와 관련된 연구비환수 금액 중 1~2개 있는 경우",{"$nulls":13},1,-1]
[null,"0점","평가기간 참여제한 통보 건수, 제재부가금 처분 통보 건수, 제재 사유와 관련된 연구비환수 금액이 모두 없는 경우",{"$nulls":13},3,-2]
[]
[null,"2)【제재처분(참여제한, 제재부가금)의 원인이 내부신고 및 자체조사인 경우】"]
[null,"점수","평가지침"]
[null,"+2점","평가기간 제재처분 건수 중 그 원인이 내부신고 및 자체조사인 경우 (제재처분 통보건수의 75%이상일 시 가점부여). 단, 연구비 환수금액 현황에서 받은 감점보다 상향하여 가점을 받을 수 없음)"]
[null,"+1점","평가기간 제제처분 건수 중 그 원인이 내부신고 및 자체조사인 경우 (제재처분 통보건수의 50%이상일 시 가점부여). 단, 연구비 환수금액 현황에서 받은 감점보다 상향하여 가점을 받을 수 없음)"]
[null,"0점","내부신고 및 자체조사가 아닌 경우"]
[]
[null,"세부평가지표",{"$nulls":7},"배점",null,"자체평가\n(단, 2)번은 직접 입력)"]
[null,"5-1. 1)제재처분(참여제한, 제재부가금) 통보건수 및 제재 사유와 관련된 연구비환수 금액 현황",{"$nulls":7},"-2~0",null,{"$f":"VLOOKUP(S14,Q20:R22,2,1)","v":-1},{"$nulls":4},0]
[null,"5-1. 2)제재처분(참여제한, 제재부가금)의 원인이 내부신고 및 자체조사인 경우",{"$nulls":7},"0~+2",null,0,{"$nulls":4},1]
[null,"5-1. 제재 통보 건수 및 연구비환수 금액",{"$nulls":7},"-2~+2",null,{"$f":"SUM(L31:M32)","v":-1},{"$nulls":4},2]
[]
[]
[]
[null,"5-2. 연구윤리 확립 노력"]
[]
[null,"구분",null,null,"자체규정 내 필수 포함 사항 및 필수 운영 사항",{"$nulls":4},"자체규정마련 \n운영 수준(O/X)","포함 내용"]
[null,"부정행위 방지를 위한 내부 규정 마련",null,null,"부정행위 범위의 부합 여부",{"$nulls":4},"X","OOO(규정 없으면 해당 셀 내용 삭제)"]
[{"$nulls":4},"부정행위 제보 및 접수 창구 운영 ",{"$nulls":4},"X","OOO(규정 없으면 해당 셀 내용 삭제)"]
[{"$nulls":4},"부정행위 의혹에 대한 조사 및 검증 절차 ",{"$nulls":4},"X","OOO(규정 없으면 해당 셀 내용 삭제)",{"$nulls":7},"집계"]
[{"$nulls":4},"부정행위의 결과에 대한 통보 및 보고 ",{"$nulls":4},"X","OOO(규정 없으면 해당 셀 내용 삭제)",{"$nulls":5},"O","O",{"$f":"COUNTIF(J40:J50,R43)","v":7}]
[{"$nulls":4},"부정행위 제보자에 대한 신변보호 및 조사대상자의 권리보호에 관한 사항",{"$nulls":4},"O","OOO(규정 없으면 해당 셀 내용 삭제)",{"$nulls":5},"X",null,{"$f":"11-S43","v":4}]
[{"$nulls":4},"부정행위 징계 가능",{"$nulls":4},"O","OOO(규정 없으면 해당 셀 내용 삭제)"]
[{"$nulls":4},"부정행위가 최종 판정 된 날로부터 중앙행정기관의 장에게 보고",{"$nulls":4},"O","OOO(규정 없으면 해당 셀 내용 삭제)"]
[null,"연구윤리 확보를 위한 자체 규정 마련",null,null,"연구개발과제의 수행과 관련하여 「과학기술기본법」 제4조제5항에 따른 진실성을 보호하기 위한 노력 및 관리체계",{"$nulls":4},"O","OOO(규정 없으면 해당 셀 내용 삭제)"]
[{"$nulls":4},"학술지 투고, 학회 참석 등 학문교류에 관한 윤리",{"$nulls":4},"O","OOO(규정 없으면 해당 셀 내용 삭제)"]
[{"$nulls":4},"인간 대상 연구 및 동물 실험에 관한 윤리",{"$nulls":4},"O","OOO(규정 없으면 해당 셀 내용 삭제)"]
[{"$nulls":4},"연구자의 권익보호 등 건전한 연구실 문화 조성",{"$nulls":4},"O","OOO(규정 없으면 해당 셀 내용 삭제)"]
[{"$nulls":4},"이해 충돌 예방 및 관리",{"$nulls":4},"O","※ 이해 충돌 예방 및 관리’는 감점 대상에서 제외되나 해당 내용을 확보·운영 중 또는 예정인 경우는 관련 규정의 유무 및 관련 내용을 적시"]
[]
[]
[null,"점수","평가지침",{"$nulls":13},"점수기준"]
[null,"-4점","자체규정 내 필수 포함 사항 및 필수 운영 사항 중 4개 이상의 사항을 마련하지 않은 경우",{"$nulls":13},0,0]
[null,"-3점","자체규정 내 필수 포함 사항 및 필수 운영 사항 중 3개 사항을 마련하지 않은 경우",{"$nulls":13},1,-1]
[null,"-2점","자체규정 내 필수 포함 사항 및 필수 운영 사항 중 2개 사항을 마련하지 않은 경우",{"$nulls":13},2,-2]
[null,"-1점","자체규정 내 필수 포함 사항 및 필수 운영 사항 중 1개 사항을 마련하지 않은 경우",{"$nulls":13},3,-3]
[null,"0점","자체규정 내 필수 포함 사항 및 필수 운영 사항을 모두 마련한 경우",{"$nulls":13},4,-4]
[{"$nulls":16},12,-4]
[null,"세부평가지표",{"$nulls":7},"배점",null,"자체평가"]
[null,"5-2. 연구윤리확립 노력 수준",{"$nulls":7},"-4~0",null,{"$f":"VLOOKUP(S44,$Q$55:$R$60,2,1)","v":-4}]

{"sheet":"6.국가R&D연구개발비 사용기준 준수여부","index":7,"n_rows":305,"n_cols":22,"rows_kept":305,"cut":false,"hidden":false,"merged":[[44,1,47,11],[87,1,90,11],[303,1,303,7],[303,8,303,9],[303,10,303,11],[304,1,304,7],[304,8,304,9],[304,10,304,11],[301,1,301,7],[301,8,301,9],[301,10,301,11],[302,1,302,7],[302,8,302,9],[302,10,302,11],[299,1,299,7],[299,8,299,9],[299,10,299,11],[300,1,300,7],[300,8,300,9],[300,10,300,11],[297,1,297,7],[297,8,297,9],[297,10,297,11],[298,1,298,7],[298,8,298,9],[298,10,298,11],[289,2,289,4],[289,5,289,7],[289,8,289,11],[293,1,293,2],[293,3,293,11],[294,1,295,1],[294,3,294,11],[295,3,295,11],[287,2,287,4],[287,5,287,7],[287,8,287,11],[288,2,288,4],[288,5,288,7],[288,8,288,11],[284,1,286,1],[284,2,284,11],[285,2,286,4],[285,5,285,11],[286,5,286,7],[286,8,286,11],[280,1,280,2],[280,3,280,4],[280,5,280,7],[280,8,280,11],[281,3,281,4],[281,5,281,7],[281,8,281,11],[267,2,267,4],[267,5,267,7],[267,8,267,11],[271,1,271,2],[271,3,271,11],[272,1,274,1],[272,3,272,11],[273,3,273,11],[274,3,274,11],[265,2,265,4],[265,5,265,7],[265,8,265,11],[266,2,266,4],[266,5,266,7],[266,8,266,11],[258,2,258,11],[262,1,264,1],[262,2,262,11],[263,2,264,4],[263,5,263,11],[264,5,264,7],[264,8,264,11],[254,2,254,3],[254,5,254,6],[254,7,254,9],[254,10,254,11],[256,2,256,11],[257,2,257,11],[252,2,252,3],[252,5,252,6],[252,7,252,9],[252,10,252,11],[253,2,253,3],[253,5,253,6],[253,7,253,9],[253,10,253,11],[249,1,251,1],[249,2,251,3],[249,4,249,11],[250,4,251,4],[250,5,250,9],[250,10,251,11],[251,5,251,6],[251,7,251,9],[239,1,239,8],[239,9,239,11],[241,2,241,11],[242,2,242,11],[242,20,243,21],[243,2,243,11],[236,1,236,8],[236,9,236,11],[237,1,237,8],[237,9,237,11],[238,1,238,8],[238,9,238,11],[224,2,224,11],[230,1,230,2],[230,5,230,11],[231,1,232,1],[231,2,232,2],[231,3,232,3],[231,4,232,4],[231,5,232,11],[219,1,219,8],[219,9,219,11],[221,2,221,11],[222,2,222,11],[222,20,223,21],[223,2,223,11],[216,1,216,8],[216,9,216,11],[217,1,217,8],[217,9,217,11],[218,1,218,8],[218,9,218,11],[207,2,207,11],[208,1,208,11],[212,1,212,2],[212,5,212,11],[213,1,214,1],[213,5,213,11],[214,5,214,11],[202,1,202,8],[202,9,202,11],[204,2,204,11],[205,2,205,11],[205,20,206,21],[206,2,206,11],[196,1,196,11],[199,1,199,8],[199,9,199,11],[200,1,200,8],[200,9,200,11],[201,1,201,8],[201,9,201,11],[185,1,185,7],[185,8,185,9],[185,10,185,11],[193,1,193,2],[193,5,193,11],[194,1,195,1],[194,5,194,11],[195,5,195,11],[183,1,183,7],[183,8,183,9],[183,10,183,11],[184,1,184,7],[184,8,184,9],[184,10,184,11],[181,1,181,7],[181,8,181,9],[181,10,181,11],[182,1,182,7],[182,8,182,9],[182,10,182,11],[179,1,179,7],[179,8,179,9],[179,10,179,11],[180,1,180,7],[180,8,180,9],[180,10,180,11],[177,1,177,7],[177,8,177,9],[177,10,177,11],[178,1,178,7],[178,8,178,9],[178,10,178,11],[171,1,173,1],[171,2,173,2],[171,4,171,11],[172,4,172,11],[173,4,173,11],[176,1,176,7],[176,8,176,9],[176,10,176,11],[167,1,167,2],[167,3,167,11],[168,1,168,2],[168,3,168,11],[170,1,170,3],[170,4,170,11],[163,6,163,11],[164,4,164,5],[164,6,164,11],[165,4,165,5],[165,6,165,11],[166,1,166,2],[166,3,166,11],[159,1,165,1],[159,4,159,5],[159,6,159,11],[160,4,160,5],[160,6,160,11],[161,4,161,5],[161,6,161,11],[162,4,162,5],[162,6,162,11],[163,4,163,5],[152,1,153,1],[152,2,153,2],[152,4,152,11],[153,4,153,11],[158,4,158,5],[158,6,158,11],[146,5,146,11],[148,1,148,8],[148,9,148,11],[149,1,149,8],[149,9,149,11],[151,1,151,3],[151,4,151,11],[142,1,142,4],[142,5,142,11],[143,1,146,1],[143,2,143,4],[143,5,143,11],[144,2,144,4],[144,5,144,11],[145,2,145,4],[145,5,145,11],[146,2,146,4],[130,1,130,8],[130,9,130,11],[133,1,133,2],[133,3,133,11],[134,1,137,1],[134,3,134,11],[135,3,135,11],[136,3,136,11],[137,3,137,11],[127,1,127,8],[127,9,127,11],[128,1,128,8],[128,9,128,11],[129,1,129,8],[129,9,129,11],[125,3,125,4],[125,6,125,7],[125,8,125,11],[124,6,124,7],[124,8,124,11],[119,2,122,2],[119,3,119,4],[119,6,119,7],[119,8,119,11],[120,3,120,4],[120,6,120,7],[120,8,120,11],[121,3,121,4],[121,6,121,7],[121,8,121,11],[117,3,117,4],[117,6,117,7],[117,8,117,11],[118,3,118,4],[118,6,118,7],[118,8,118,11],[110,1,110,8],[110,9,110,11],[115,1,115,4],[115,6,115,7],[115,8,115,11],[116,1,125,1],[116,2,118,2],[116,3,116,4],[116,6,116,7],[116,8,116,11],[122,3,122,4],[122,6,122,7],[122,8,122,11],[123,2,125,2],[123,3,123,4],[123,6,123,7],[123,8,123,11],[124,3,124,4],[104,18,106,18],[105,4,105,11],[106,4,106,11],[107,18,109,18],[109,1,109,8],[109,9,109,11],[100,1,100,8],[100,9,100,11],[103,1,103,3],[103,4,103,11],[104,1,106,1],[104,2,106,2],[104,4,104,11],[95,1,97,1],[95,4,95,5],[96,4,96,5],[97,4,97,5],[99,1,99,8],[99,9,99,11],[92,1,94,2],[92,3,92,5],[92,6,92,11],[93,3,94,3],[93,4,94,5],[93,6,93,8],[93,9,93,11],[80,1,80,3],[80,4,80,11],[81,1,82,1],[81,2,82,2],[81,4,81,11],[82,4,82,11],[77,1,77,3],[77,4,77,6],[77,7,77,11],[78,1,78,3],[78,4,78,6],[78,7,78,11],[67,18,69,18],[69,1,69,8],[69,9,69,11],[70,1,70,8],[70,9,70,11],[75,1,76,3],[75,4,76,6],[75,7,76,11],[64,1,66,1],[64,2,66,2],[64,4,64,11],[64,18,66,18],[65,4,65,11],[66,4,66,11],[58,1,58,8],[58,9,58,11],[59,1,59,8],[59,9,59,11],[63,1,63,3],[63,4,63,11],[51,9,52,9],[51,10,52,10],[51,11,52,11],[53,1,55,1],[53,4,53,5],[54,4,54,5],[55,4,55,5],[49,1,52,2],[49,3,49,5],[49,6,49,11],[50,3,52,3],[50,4,52,5],[50,6,50,8],[50,9,50,11],[51,6,52,6],[51,7,52,7],[51,8,52,8],[36,1,36,3],[36,4,36,11],[37,1,39,1],[37,2,39,2],[37,4,37,11],[38,4,38,11],[39,4,39,11],[32,1,32,8],[32,9,32,11],[33,1,33,8],[33,9,33,11],[34,1,34,8],[34,9,34,11],[29,1,30,1],[29,3,29,4],[29,5,29,6],[29,7,29,11],[30,3,30,4],[30,5,30,6],[30,7,30,11],[21,1,23,1],[21,2,23,2],[21,4,21,11],[22,4,22,11],[23,4,23,11],[28,1,28,2],[28,3,28,4],[28,5,28,6],[28,7,28,11],[17,1,17,8],[17,9,17,11],[18,1,18,8],[18,9,18,11],[20,1,20,3],[20,4,20,11],[3,1,8,11],[13,1,13,4],[13,5,13,11],[14,2,14,4],[14,5,14,11],[16,1,16,8],[16,9,16,11]]}
[]
[null,"6-1. 직접비 관리의 적절성"]
[]
[null,"* 작성시 유의사항\n- 기관에 해당사항이 없는 경우 1) \"O/X\"를 선택하는 항목에는 \"X\"를 표시하고, 2) \"0\"원을 입력하는 항목은 \"0\"원을 입력하되\n  상기 항목 외에는 반드시 해당 셀을 \"빈 칸\"으로 유지함 \n- 하기 템플릿에 대하여 행, 열의 삽입 또는 삭제는 금지\n  (다만, 6-1. ⑦ 직접비 부당집행기준 위반 과제 현황에서만 행 삽입 가능)"]
{"$rows_empty":7}
[null,"① 인건비 – 인건비 계상률 관리의 적절성"]
[]
[null,"구분",null,null,null,"세부 내용"]
[null,"인건비","인건비 계상률 관리의 적절성",null,null,"작성자 입력"]
[]
[null,"평가항목",{"$nulls":7},"해당 여부(O/X)"]
[null,"부처별, 사업별, 과제별, 기간별, 연구자별 인건비 계상률에 대해 사전통제시스템이 있으며, 상시 조회 가능한 경우",{"$nulls":7},"O",{"$nulls":5},"O"]
[null,"인건비 계상률 따른 인건비등의 지급관리가 가능한 경우",{"$nulls":7},"X",{"$nulls":5},"X"]
[]
[null,"점수",null,null,"평가지침",{"$nulls":10},"6-1. ① 점수"]
[null,"인건비","인건비 \n계상률 \n관리의 \n적절성","3점","부처별, 사업별, 과제별, 기간별, 연구자별 인건비 계상률에 대해 사전통제시스템이 있으며, 상시 조회 가능하며, 인건비 계상률 따른 인건비등의 지급관리가 가능한 경우",{"$nulls":10},{"$f":"IF(J18=\"O\",IF(J19=\"O\",3,2),0)","v":2}]
[null,null,null,"2점","부처별, 사업별, 과제별, 기간별, 연구자별 인건비 계상률에 대해 사전통제시스템이 있으며, 상시 조회 가능한 경우"]
[null,null,null,"0점","부처별, 사업별, 과제별, 기간별, 연구자별 인건비 계상률에 대해 사전통제시스템이 없는 경우"]
[]
[]
[null,"② 인건비 – 고용(근로) 계약 체결의 적절성"]
[]
[null,"구분",null,"규정명",null,"조항",null,"조항 내용"]
[null,"인건비","인건비 \n지급절차","작성자 입력",null,"작성자 입력",null,"작성자 입력",{"$nulls":7},{"$f":"COUNTA(D30:E31)","v":2}]
[null,null,"고용(근로\n계약) 체결 \n기준 및 절차","작성자 입력",null,"작성자 입력",null,"작성자 입력"]
[]
[null,"평가항목",{"$nulls":7},"해당 여부(O/X)"]
[null,"1) 인건비 지급 절차 및 고용계약 체결 기준 게시 ",{"$nulls":7},"O",{"$nulls":5},"O"]
[null,"\t2) 연구원 본인의 인건비 지급내역 확인 시스템이 있는 경우",{"$nulls":7},"X",{"$nulls":5},"X"]
[]
[null,"점수",null,null,"평가지침",{"$nulls":10},"6-1. ② 점수"]
[null,"인건비","고용(근로)\n계약 체결 \n적정성 ","3점","2가지 항목이 있는 경우\n\t1) 인건비 지급 절차 및 고용계약 체결 기준 게시 \n\t2) 연구원 본인의 인건비 지급내역 확인 시스템이 있는 경우",{"$nulls":10},{"$f":"IF(J34=\"O\",IF(J35=\"O\",3,1),0)","v":1}]
[null,null,null,"1점","1가지 항목만 있는 경우"]
[null,null,null,"0점","인건비 지급 절차 및 고용계약 체결 기준 게시가 되지 않는 경우"]
[]
[]
[null,"③-1 연구시설･장비비 – 연구시설･장비의 중앙구매체계 운영 여부 및 이용 정도"]
[]
[null,"* 작성시 유의사항\n- 기준단가는 국내구매와 국외구매 모두 \"단일건 100만원 이상\"인 경우, 합계에 \"단일건 기준 100만원 이상\"으로 기재 가능함\n   만약 국내구매는 100만원 이상이고, 국외구매는 300만원 이상인 경우에는 합계에 \"단일건 기준 300만원 이상\"으로 기재함\n   국내구매 또는 국외구매 어느 하나 가지라도 중앙구매체계를 따르지 않으면 합계에도 \"해당 없음\" 선택"]
[]
[]
[]
[]
[null,"구분",null,"중앙구매체계 ",null,null,"중앙구매 비율"]
[null,null,null,"구비 \n여부","기준단가",null,"구매건수",null,null,"구매액"]
[{"$nulls":6},"총구매건수","중앙 \n구매건수","비율(%)","총 구매액(천원)","중앙 \n구매액 \n(천원)","비율(%)"]
[{"$nulls":16},"해당 없음"]
[null,"연구시설･\n장비비","국내구매","O","단일건 기준 \n100만원 이상",null,1117,1019,{"$f":"IFERROR(H54/G54,0)","v":0.91226499552372431},12934129,12728897,{"$f":"IFERROR(K54/J54,0)","v":0.98413252256877903},"○",null,null,"O","단일건 기준 \n100만원 이상"]
[null,null,"국외구매","O","단일건 기준 \n300만원 이상",null,74,50,{"$f":"IFERROR(H55/G55,0)","v":0.67567567567567566},7455108,7000000,{"$f":"IFERROR(K55/J55,0)","v":0.93895353360407385},"X",null,null,"X","단일건 기준 \n300만원 이상"]
[null,null,"합 계","O","단일건 기준 \n300만원 이상",null,{"$f":"SUM(G54:G55)","v":1191},{"$f":"SUM(H54:H55)","v":1069},{"$f":"IFERROR(H56/G56,0)","v":0.89756507136859787},{"$f":"SUM(J54:J55)","v":20389237},{"$f":"SUM(K54:K55)","v":19728897},{"$f":"IFERROR(K56/J56,0)","v":0.96761330500008413}]
[null," ※ 단일건 기준 : 100만원 이상"]
[]
[null,"평가항목",{"$nulls":7},"해당 여부(O/X)"]
[null,"단가 100만원 이상(부가가치세포함)의 연구시설･장비 구매 실적 여부",{"$nulls":7},"O"]
[]
[]
[null," - 단가 100만원 이상(부가가치세포함)의 연구시설･장비 구매 실적이 있는 경우"]
[null,"점수",null,null,"평가지침",{"$nulls":10},"③-1 점수(구매실적 있는 경우)",null,null,"(점수 Case)"]
[null,"연구시설･\n장비비","연구시설･\n장비의 중앙\n구매체계 \n운영 여부 및\n이용 정도","3점","단가 100만원 이상의 연구시설･장비 구매 시 중앙구매체계 운영 여부 및 이용 실적이 각 90%이상인 경우 ",{"$nulls":10},{"$f":"IF(E56=Q54,IF(L56>=0.9,3,IF(L56>=0.8,1,0)))+IF(E56=Q55,IF(L56>=0.8,1,0))","v":1},null,null,"100만원\n이상",0.95,3]
[null,null,null,"1점","단가 300만원 이상의 연구시설･장비 구매 시 중앙구매체계 운영 여부 및 이용 실적이 각 80%이상인 경우 ",{"$nulls":14},0.85,1]
[null,null,null,"0점","단가 300만원 이상의 연구시설･장비 구매 시 중앙구매체계 운영 여부 및 이용 실적이 각 80%미만인 경우 ",{"$nulls":10},"③-1 점수(구매실적 없는 경우)",null,null,null,0.75,0]
[{"$nulls":15},{"$f":"IF(J71=\"O\",3,0)","v":3},null,null,"300만원",0.95,1]
[null," - 단가 100만원 이상(부가가치세포함)의 연구시설･장비 구매 실적이 없는 경우",{"$nulls":17},0.85,1]
[null,"평가항목",{"$nulls":7},"해당 여부(O/X)",{"$nulls":5},"6-1. ③-1 점수(최종)",null,null,null,0.75,0]
[null,"전담조직 또는 기관에서 구입한 연구장비 등의 구매절차 및 자산관리 적정성으로 평가",{"$nulls":7},"O",{"$nulls":5},{"$f":"IF(J60=\"O\",P65,P68)","v":1}]
[]
[]
[null,"③-2 연구시설･장비비 통합관리제 도입 및 내부 운영규정 마련 여부"]
[]
[null,"구분",null,null,"도입･마련 여부 (O, X)",null,null,"증빙"]
[]
[null,"연구시설･장비비 통합관리제 도입",null,null,"O",null,null,"- 지정 일자 :\n- 지정 번호 :",{"$nulls":7},"O"]
[null,"연구시설･장비비 통합관리제 \n내부 운영규정 마련",null,null,"X",null,null,"규정 명칭 : (규정 필수 첨부)",{"$nulls":7},"X"]
[]
[null,"점수",null,null,"평가지침"]
[null,"연구시설･\n장비비","연구시설･장비비 통합관리제 도입 및 내부 운영규정 마련 여부","+1점","연구시설･장비비 통합관리제를 도입 후 인증 완료와 내부 운영규정 마련을 완료한 경우",{"$nulls":10},"6-1. ③-2 점수"]
[null,null,null,"0점","연구시설･장비비 통합관리제를 도입하지 않은 경우",{"$nulls":10},{"$f":"IF(E78=\"O\",IF(E79=\"O\",1,0),0)","v":0}]
[]
[]
[null,"④ 연구재료비 – 연구재료(시약포함)의 중앙구매체계 운영 여부 및 이용 정도"]
[]
[null,"* 작성시 유의사항\n- 기준단가는 국내구매와 국외구매 모두 \"단일구매총액 300만원 이상\"인 경우, 합계에 \"단일구매총액 기준 300만원 이상\"으로 기재 가능함\n   만약 국내구매는 300만원 이상이고, 국외구매는 500만원 이상인 경우에는 합계에 \"단일구매총액 기준 500만원 이상\"으로 기재함\n   국내구매 또는 국외구매 어느 하나 가지라도 중앙구매체계를 따르지 않으면 합계에도 \"해당 없음\" 선택"]
[]
[]
[]
[]
[null,"구분",null,"중앙구매체계 ",null,null,"중앙구매 비율"]
[null,null,null,"구비 여부\n(○/X)","기준단가\n(예) 단일구매총액 \n300만원 이상)",null,"구매건수",null,null,"구매액"]
[{"$nulls":6},"총 구매건수","중앙 \n구매건수","비율(%)","총 구매액\n(천원)","중앙구매액 \n(천원)","비율(%)",{"$nulls":4},"해당 없음"]
[null,"연구 재료비","국내구매","O","단일구매총액\n 300만원 이상",null,1284,1284,{"$f":"IFERROR(H96/G96,0)","v":1},15088321,15088320,{"$f":"IFERROR(K96/J96,0)","v":0.99999993372357332},null,null,null,"O","단일구매총액\n 300만원 이상"]
[null,null,"국외구매","O","단일구매총액\n 500만원 이상",null,177,17,{"$f":"IFERROR(H97/G97,0)","v":9.6045197740112997E-2},2389827,2389820,{"$f":"IFERROR(K97/J97,0)","v":0.99999707091768564},null,null,null,"X","단일구매총액\n 500만원 이상"]
[null,null,"합계","O","단일구매총액\n 500만원 이상",null,{"$f":"SUM(G96:G97)","v":1461},{"$f":"SUM(H96:H97)","v":1301},{"$f":"IFERROR(H98/G98,0)","v":0.89048596851471595},{"$f":"SUM(J96:J97)","v":17478148},{"$f":"SUM(K96:K97)","v":17478140},{"$f":"IFERROR(K98/J98,0)","v":0.99999954228560139}]
[]
[null,"평가항목",{"$nulls":7},"해당 여부(O/X)"]
[null,"중앙구매 관련 단일 구매 총액 300만원 이상(부가가치세포함)의 연구재료(시약포함) 구매 실적 여부",{"$nulls":7},"O"]
[]
[null," - 단일 구매 총액 300만원 이상(부가가치세포함)의 연구재료(시약포함) 구매 실적이 있는 경우"]
[null,"점수",null,null,"평가지침",{"$nulls":10},"④ 점수(구매실적 있는 경우)",null,null,"(점수 Case)"]
[null,"연구재료비","연구재료\n(시약 포함)의\n 중앙구매 \n체계 구비 \n여부 ","3점","단일 구매 총액 300만원 이상의 연구재료(시약) 구매 시 중앙구매체계 운영 여부 및 이용 실적이 각 60%이상인 경우 ",{"$nulls":10},{"$f":"IF(E98=Q96,IF(L98>=0.6,3,IF(L98>=0.8,1,0)))+IF(E98=Q97,IF(L98>=0.8,1,0))","v":1},null,null,"300만원\n이상",0.95,3]
[null,null,null,"1점","단일 구매 총액 500만원 이상의 연구재료(시약) 구매 시 중앙구매체계 운영 여부 및 이용 실적이 각 80%이상인 경우 ",{"$nulls":14},0.75,3]
[null,null,null,"0점","단일 구매 총액 500만원 이상의 연구재료(시약) 구매 시 중앙구매체계 운영 여부 및 이용 실적이 각 80%미만인 경우 ",{"$nulls":14},0.55000000000000004,0]
[{"$nulls":15},"④ 점수(구매실적 없는 경우)",null,null,"500만원",0.95,1]
[null," - 단일 구매 총액 300만원 이상(부가가치세포함)의 연구재료(시약포함) 구매 실적이 없는 경우",{"$nulls":13},{"$f":"IF(J111=\"O\",3,0)","v":3},null,null,null,0.75,0]
[null,"평가항목",{"$nulls":7},"해당 여부(O/X)",{"$nulls":9},0.55000000000000004,0]
[null,"전담조직 또는 기관에서 구입한 연구재료(시약포함) 등의 구매절차 및 자산관리 적정성으로 평가",{"$nulls":7},"O",{"$nulls":5},"6-1. ④ 점수(최종)"]
[{"$nulls":15},{"$f":"IF(J101=\"O\",P105,P109)","v":1}]
[]
[null,"⑤ 연구활동비 – 국내･외 여비, 전문가활용비, 회의비 및 식대"]
[]
[null,"구분",null,null,null,"통제여부","통제 방법",null,"구축･운영 시작일"]
[null,"연구활동비","국내･외여비","기준단가 준수 ",null,"O",{"$nulls":9},"O"]
[null,null,null,"중복출장 검증 ",null,"O",{"$nulls":9},"X"]
[null,null,null,"출장 후 DB구축 탑재 \n여부 (증빙 탑재 및 \n정보공유)",null,"O","시스템입력항목, DB항목",{"$nulls":9},"항목수","집계"]
[null,null,"전문가 활용비","기간내 집행 ",null,"X","시스템 (입력불가/팝업창 생성) / 기타(방법기재)",{"$nulls":7},"국내외여비","O",3,{"$f":"COUNTIF(F117:F119,P120)","v":3}]
[null,null,null,"기준 단가 ",null,"O","･",{"$nulls":7},"전문가활용비","O",4,{"$f":"COUNTIF(F120:F123,P121)","v":3}]
[null,null,null,"수행과제 관련성",null,"O","관련 검증방법 기재 ",{"$nulls":7},"회의비","O",3,{"$f":"COUNTIF(F124:F126,P122)","v":2}]
[null,null,null,"전문가 자문내역 \n확인여부",null,"O","･"]
[null,null,"회의비 및 식대","기간내 집행 ",null,"X","시스템 (입력불가/팝업창 생성) / 기타(방법기재)"]
[null,null,null,"회의록 작성여부\n(외부참석자 확인 등)",null,"O"]
[null,null,null,"평일 점심식대 통제\n(특/야근)",null,"O"]
[]
[null,"평가항목",{"$nulls":7},"해당 여부(O/X)"]
[null,"1) 국내외 여비(자체 여비규정에 따라 사전, 사후 통제절차를 수행하고 있는 경우, 예, 연구기간 내 집행, 비참여연구자 배제, 중복출장 통제, 기준단가 준수, 출장 후 DB구축 등)",{"$nulls":7},{"$f":"IF(Q120=R120,\"O\",\"X\")","v":"O"},{"$nulls":5},"O"]
[null,"2) 전문가 활용비(자체 전문가활용비 규정에 따라 연구기간 내 집행, 기준단가, 수행과제 관련성, 전문가 자문내역 확인여부 등)",{"$nulls":7},"O",{"$nulls":5},"X"]
[null,"3) 회의비 등(자체 회의비 및 식대 규정에 따라 사전, 사후 통제절차를 수행하고 있는 경우 예, 연구기간 내 집행, 회의비 집행 시 외부참석자 확인, 특근/야근 식대 기준 준수 등)",{"$nulls":7},{"$f":"IF(Q122=R122,\"O\",\"X\")","v":"X"}]
[]
[{"$nulls":15},"집계"]
[null,"점수",null,"평가지침",{"$nulls":11},{"$f":"COUNTIF($J$129:$L$131,P129)","v":2}]
[null,"연구활동비(3점)","3점","비목별 집행 절차의 적정성에 따른 3개 항목을 모두 확보한 경우\n1) 국내외 여비(자체 여비규정에 따라 사전, 사후 통제절차를 수행하고 있는 경우, 예, 연구기간 내 집행, 비참여연구자 배제, 중복출장 통제, 기준단가 준수, 출장 후 DB구축 등)\n2) 전문가 활용비(자체 전문가활용비 규정에 따라 연구기간 내 집행, 기준단가, 수행과제 관련성, 전문가 자문내역 확인여부 등)\n3) 회의비 등(자체 회의비 및 식대 규정에 따라 사전, 사후 통제절차를 수행하고 있는 경우 예, 연구기간 내 집행, 회의비 집행 시 외부참석자 확인, 특근/야근 식대 기준 준수 등)"]
[null,null,"2점","2개 항목만 확보한 경우",{"$nulls":11},"6-1. ⑤ 점수",null,0,0]
[null,null,"1점","1개 항목만 확보한 경우",{"$nulls":11},{"$f":"VLOOKUP(P134,$R$136:$S$139,2,1)","v":2},null,1,1]
[null,null,"0점","1가지 항목도 확보 못한 경우",{"$nulls":13},2,2]
[{"$nulls":17},3,3]
[]
[null,"⑥ 연구수당 – 기여도 평가 적절성"]
[]
[null,"구분",null,null,null,"검토서류"]
[null,"연구수당","기여도 평가 세부 평가항목",null,null,"연구성과, 참여도·창의성, 기타"]
[null,null,"기여도평가 인원",null,null,"전체 참여연구원"]
[null,null,"평가 기준 보유여부",null,null,"연구기관"]
[null,null,"개별 기준 사용여부",null,null,"작성자 입력"]
[]
[null,"평가항목",{"$nulls":7},"해당 여부(O/X)",{"$nulls":5},"O"]
[null,"기여도 평가 관련 세부평가항목을 보유하고, 기여도 평가시 참여연구자 전체를 평가하는 경우",{"$nulls":7},"O",{"$nulls":5},"X"]
[]
[null,"점수",null,null,"평가지침"]
[null,"연구수당","기여도 평가 적절성","1점","기여도 평가 관련 세부평가항목을 보유하고, 기여도 평가시 참여연구자 전체를 평가하는 경우",{"$nulls":10},"6-1. ⑥ 점수"]
[null,null,null,"0점","기여도 평가 관련 세부평가항목을 보유하지 않거나, 기여도 평가시 참여연구자 전체를 평가하지 않는 경우",{"$nulls":10},{"$f":"IF(J150=\"O\",1,0)","v":1}]
[]
[]
[null,"⑦ 직접비(총괄) - 직접비 부당집행기준 위반 여부"]
[]
[null,"구분","과제명","지적 내용","지적한 정산 기관",null,"지적일"]
[null,"직접비 부당집행기준 위반 과제 현황","작성자 입력","작성자 입력","작성자 입력",null,"작성자 입력"]
[]
[]
[]
[]
[]
[]
[null,"직접비 부당집행으로 통보된 과제 개수 총계(A)\n(없으면 \"0\"으로 표시)",null,0]
[null,"연구개발기관이 평가기관 동안 정산된 국가연구개발사업 수탁과제 개수 총계(B)",null,100]
[null,"직접비 부당집행으로 통보된 과제 개수 총계(A)/연구개발기관이 평가기관 동안 정산된 국가연구개발사업 수탁과제 개수 총계(B)",null,{"$f":"D167/D168","v":0}]
[]
[null,"점수",null,null,"평가지침",{"$nulls":10},"6-1. ⑦ 점수"]
[null,"직접비","부당집행기준 위반 여부","2점","평가기간 중 직접비 부당집행으로 정산기관에서 불인정 사례를 포함한 과제가 없는 경우",{"$nulls":10},{"$f":"IFERROR(IF(D167=0,2,IF(D169<=0.1,1,0)),0)","v":2}]
[null,null,null,"1점 ","평가기간 중 직접비 부당집행으로 정산기관에서 불인정 사례를 포함한 과제가 A/B가 10% 이하인 경우"]
[null,null,null,"0점","평가기간 중 직접비 부당집행으로 정산기관에서 불인정 사례를 포함한 과제가 A/B가 10% 초과한 경우"]
[]
[]
[null,"세부평가지표",{"$nulls":6},"배점",null,"자체평가"]
[null,"6-1. ① 인건비 – 인건비 계상률 관리의 적절성",{"$nulls":6},3,null,{"$f":"P22","v":2}]
[null,"6-1. ② 인건비 – 고용(근로) 계약 체결의 적절성",{"$nulls":6},3,null,{"$f":"P38","v":1}]
[null,"6-1. ③-1 연구시설･장비비 – 연구시설･장비의 중앙구매체계 운영 여부 및 이용 정도",{"$nulls":6},3,null,{"$f":"P71","v":1}]
[null,"6-1. ③-2 연구시설･장비비 통합관리제 도입 및 내부 운영규정 마련 여부",{"$nulls":6},"+1",null,{"$f":"P83","v":0}]
[null,"6-1. ④ 연구재료비 – 연구재료(시약포함)의 중앙구매체계 운영 여부 및 이용 정도",{"$nulls":6},3,null,{"$f":"P112","v":1}]
[null,"6-1. ⑤ 연구활동비 – 국내･외 여비, 전문가활용비, 회의비 및 식대",{"$nulls":6},3,null,{"$f":"P137","v":2}]
[null,"6-1. ⑥ 연구수당 – 기여도 평가 적절성",{"$nulls":6},1,null,{"$f":"P154","v":1}]
[null,"6-1. ⑦ 직접비(총괄) - 직접비 부당집행기준 위반 여부",{"$nulls":6},2,null,{"$f":"P172","v":2}]
[null,"6-1. 직접비 관리의 적절성",{"$nulls":6},"18(+1)",null,{"$f":"SUM(K178:L185)","v":10}]
[]
[]
[]
[null,"6-2. 간접비 관리의 적절성"]
[]
[null,"① 인력지원비 집행계획 수립 및 동 수립계획에 따른 집행여부"]
[]
[null,"구분",null,"실시여부","시행 근거자료","비고"]
[null,"인력지원비","사전계획수립","O","관련공문 또는 서류","시행시기(연도-월)",{"$nulls":6},"○",null,null,"O"]
[null,null,"집행","X","실시후 지급\n공문, 관련서류",{"$nulls":7},"X",null,null,"X"]
[null,"※ 특히, 연구개발능률성과급 관련규정, 연구개발능률성과급 집행 관련 세부적으로 증빙서류 제출"]
[null," (증빙서류 미제출 시에는 평가에서 제외)"]
[]
[null,"평가항목",{"$nulls":7},"해당 여부(O/X)"]
[null,"인력지원비에 대한 자체 집행기준 여부",{"$nulls":7},"O",{"$nulls":5},"O"]
[null,"인력지원비에 대한 자체 집행계획 여부",{"$nulls":7},"O",{"$nulls":5},"X"]
[null,"인력지원비 집행계획에 따라 집행 여부",{"$nulls":7},"O"]
[]
[null,"점수","평가 지침",{"$nulls":12},"6-2. ① 점수",null,"(점수 Case)"]
[null,"2점","인력지원비에 대한 자체 집행기준이 있고, 집행계획을 수립하여 계획에 따라 집행한 경우",{"$nulls":12},{"$f":"IF(J203=\"O\",IF(J201=\"O\",IF(J202=\"O\",2,1),IF(J202=\"O\",1,0)),0)","v":2},null,"O","O","X","All"]
[null,"1점","인력지원비에 대한 자체 집행기준 또는 집행계획을 수립하여 기준 또는 계획에 따라 집행한 경우",{"$nulls":14},"O","X","O"]
[null,"0점","인력지원비에 대한 자체 집행기준 또는 집행계획을 수립한 경우",{"$nulls":14},"O","O","O","X","X"]
[null,"   ※연구개발능률성과급의 계상비율 준수여부, 성과평가 기준 및 시행여부를 중점적으로 평가",{"$nulls":15},2,1,1,2,2]
[]
[null,"② 연구지원비 집행계획 수립 및 동 수립계획에 따른 집행여부"]
[]
[null,"구분",null,"실시여부(O/X)","시행 근거자료","비고"]
[null,"연구지원비","사전계획수립","O","관련공문 \n또는 서류","시행시기(연도-월)",{"$nulls":9},"O"]
[null,null,"집행","O","실시후 지급\n공문, 관련서류",{"$nulls":10},"X"]
[]
[null,"평가항목",{"$nulls":7},"해당 여부(O/X)"]
[null,"연구지원비에 대한 자체 집행기준 여부",{"$nulls":7},"X",{"$nulls":5},"O"]
[null,"연구지원비에 대한 자체 집행계획 여부",{"$nulls":7},"O",{"$nulls":5},"X"]
[null,"연구지원비 집행계획에 따라 집행 여부",{"$nulls":7},{"$f":"D215","v":"O"}]
[]
[null,"점수","평가 지침",{"$nulls":12},"6-2. ② 점수",null,"(점수 Case)"]
[null,"2점","연구지원비에 대한 자체 집행기준이 있고, 집행계획을 수립하여 계획에 따라 집행한 경우",{"$nulls":12},{"$f":"IF(J220=\"O\",IF(J218=\"O\",IF(J219=\"O\",2,1),IF(J219=\"O\",1,0)),0)","v":1},null,"O","O","X","All"]
[null,"1점","연구지원비에 대한 자체 집행기준 또는 집행계획을 수립하여 기준 또는 계획에 따라 집행한 경우",{"$nulls":14},"O","X","O"]
[null,"0점","연구지원비에 대한 자체 집행기준 또는 집행계획을 수립한 경우",{"$nulls":14},"O","O","O","X","X"]
[{"$nulls":17},2,1,1,2,2]
[null,"③ 성과활용지원비 집행계획 수립 및 동 수립계획에 따른 집행규모"]
[]
[null,"1) 성과활용지원비 집행계획 수립"]
[]
[null,"구분",null,"실시여부\n(O/X)","시행 근거자료","비고"]
[null,"성과활용 \n지원비","사전계획수립","O","관련공문 또는 서류","시행시기(연도-월)"]
[]
[null,"   ※ 특히, 과학문화활동비 및 지식재산권 출원·등록비 관련규정, 과학문화활동비 및 지식재산권 출원·등록비 집행관련 결산서 해당 내용 제출"]
[null,"    (결산서상 해당 내용을 미제출 시에는 평가에서 제외)"]
[]
[null,"평가항목",{"$nulls":7},"해당 여부(O/X)"]
[null,"성과활용지원비에 대한 자체 집행기준 여부",{"$nulls":7},"O",{"$nulls":5},"O"]
[null,"성과활용지원비에 대한 자체 집행계획 여부",{"$nulls":7},"X",{"$nulls":5},"X"]
[null,"성과활용지원비 집행기준 또는 집행계획에 따라 집행 여부",{"$nulls":7},"O"]
[]
[null,"점수","평가 지침",{"$nulls":12},"6-2. ③ 1) 점수",null,"(점수 Case)"]
[null,"1점","성과활용지원비에 대한 자체 집행기준이 있고, 집행계획을 수립하여 계획에 따라 집행한 경우",{"$nulls":12},{"$f":"IF(J240=\"O\",IF(J238=\"O\",IF(J239=\"O\",1,0),0),0)","v":0},null,"O","O","X","All"]
[null,"0점","성과활용지원비에 대한 자체 집행기준 또는 집행계획을 수립하여 기준 또는 계획에 따라 집행한 경우",{"$nulls":14},"O","X","O"]
[{"$nulls":17},"O","O","O","X","X"]
[{"$nulls":17},1,0,0,0,0]
[]
[null,"2) 수립계획에 따른 집행 규모"]
[]
[null,"구 분","간접비 수익 전체(A)",null,"수립계획에 따른 집행 규모"]
[{"$nulls":4},"성과활용\n지원비 지출 \n금액 총계(B)","성과활용비 세부 내역",{"$nulls":4},"비율(B/A)"]
[{"$nulls":5},"과학문화활동비",null,"지식재산권 출원등록비"]
[null,"최근 2년 전(2020.1.1 ~ 2020.12.31)",131900000,null,37900000,0,null,0,null,null,{"$f":"IFERROR(E253/C253,0)","v":0.28733889310083399}]
[null,"최근 1년 전(2021.1.1 ~ 2021.12.31)",115790000,null,1830000,20,null,40,null,null,{"$f":"IFERROR(E254/C254,0)","v":1.5804473616029019E-2}]
[null,"2개년 평균 (2020.1.1  ~ 2021.12.31)",{"$f":"IFERROR(AVERAGE(C253:D254),0)","v":123845000},null,{"$f":"IFERROR(AVERAGE(E253:E254),0)","v":19865000},{"$f":"IFERROR(AVERAGE(F253:G254),0)","v":10},null,{"$f":"IFERROR(AVERAGE(H253:J254),0)","v":20},null,null,{"$f":"IFERROR(E255/C255,0)","v":0.16040211554766037}]
[]
[null,"점수","평가 지침",{"$nulls":12},"6-2. ③ 2) 점수"]
[null,"1점","간접비 지출 대비 성과활용지원비 집행 비율이 6% 이상인 경우",{"$nulls":12},{"$f":"IF(K255>=6%,1,0)","v":1}]
[null,"0점","간접비 지출 대비 성과활용지원비 집행 비율이 6% 미만인 경우"]
[]
[null,"④ 연구보안관리비의 간접비 지출 규모"]
[]
[null,"구분","연구보안관리비의 간접비 지출 규모(단위: 비율%)"]
[null,null,"간접비 지출 (A)",null,null,"연구보안관리비 지출 금액 및 비율(B/A)"]
[{"$nulls":5},"연구보안관리비(B)",null,null,"비율(B/A)"]
[null,"최근 2년 전(2020.1.1 ~ 2020.12.31)",131900850,null,null,555555,null,null,{"$f":"IFERROR(F266/C266,0)","v":4.2119137215567599E-3}]
[null,"최근 1년 전(2021.1.1 ~ 2021.12.31)",35424890,null,null,445000,null,null,{"$f":"IFERROR(F267/C267,0)","v":1.2561789182690476E-2}]
[null,"2개년 평균 (2020.1.1  ~ 2021.12.31)",{"$f":"IFERROR(AVERAGE(C266:E267),0)","v":83662870},null,null,{"$f":"IFERROR(AVERAGE(F266:H267),0)","v":500277.5},null,null,{"$f":"IFERROR(F268/C268,0)","v":5.9796836995909897E-3}]
[null,"   ※ 반드시 결산서에 연구보안관리비 비목으로 확정된 경우만 인정(간접비 원가산출 제출자료와 동일할 것)"]
[null,"   ※ 특히, 간접비지출액, 연구보안관리비 관련 결산서 해당 내용 제출(결산서상 해당 내용을 미제출 시에는 평가에서 제외)"]
[]
[null,"점수",null,"평가지침",{"$nulls":11},"6-2. ④ 점수"]
[null,"학교회계\n전출금의 \n간접비 지출 \n합리성","+2점","간접비 지출 대비 연구보안관리비 지출 비율 1% 이상인 경우",{"$nulls":11},{"$f":"VLOOKUP(I268,R273:S276,2,1)","v":1},null,0,0]
[null,null,"+1점","간접비 지출 대비 연구보안관리비 지출 비율 0.5% 이상, 1%미만인 경우",{"$nulls":13},5.0000000000000001E-3,1]
[null,null,"0점","간접비 지출 대비 연구보안관리비 지출 비율 0.5% 미만인 경우",{"$nulls":13},0.01,2]
[{"$nulls":17},1,2]
[]
[null,"⑤ 연구실 안전관리비"]
[]
[null,"1) 사전계획수립"]
[null,"구분",null,"실시여부(O/X)",null,"시행 근거자료",null,null,"비고 ",{"$nulls":6},"O"]
[null,"연구실 \n안전관리","사전계획\n수립","O",null,"관련공문 또는 서류",null,null,"시행시기(연도-월)",{"$nulls":6},"X"]
[]
[null,"2) 연구실 안전관리비 지출"]
[null,"구분","연구실 안전관리비의 간접비 지출 규모(단위: 비율%)"]
[null,null,"간접비수익 (A)",null,null,"연구실 안전관리비 지출 금액 및 비율(B/A)"]
[{"$nulls":5},"연구실 안전관리비(B)",null,null,"비율(B/A)"]
[null,"최근2년전 (2021.3.1. ~ 2022.2.28)",131590423,null,null,12652254,null,null,{"$f":"IFERROR(F288/C288,0)","v":9.6148744806451455E-2}]
[null,"최근1년전 (2022.3.1. ~ 2023.2.28)",13257900,null,null,151234,null,null,{"$f":"IFERROR(F289/C289,0)","v":1.1407085586706793E-2}]
[null,"2개년 평균 (2021.3.1. ~ 2023.2.28)",{"$f":"IFERROR(AVERAGE(C288:E289),0)","v":72424161.5},null,null,{"$f":"IFERROR(AVERAGE(F288:H289),0)","v":6401744},null,null,{"$f":"IFERROR(F290/C290,0)","v":8.8392379938012813E-2}]
[null,"   ※ 반드시 결산서에 연구실안전관리비 비목으로 확정된 경우만 인정(간접비 원가산출 제출자료와 동일할 것)"]
[null,"   ※ 특히, 간접비지출액, 연구실안전관리비 관련 결산서 해당 내용 제출(결산서상 해당 내용을 미제출 시에는 평가에서 제외)"]
[]
[null,"점수",null,"평가지침",{"$nulls":11},"6-2. ⑤ 점수"]
[null,"연구실안전\n관리비의 \n간접비 지출\n규모 ","1점","2가지 항목을 모두 충족\n1) 사전계획수립 있는 경우\n2) 간접비수익 대비 연구실안전관리비 지출 비율 1% 이상인 경우",{"$nulls":11},{"$f":"IF(D282=\"O\",IF(I290>=1%,1,0),0)","v":1}]
[null,null,"0점","1가지 이하 항목을 충족"]
[]
[null,"세부평가지표",{"$nulls":6},"배점",null,"자체평가"]
[null,"6-2. ① 인력지원비 집행계획 수립 및 동 수립계획에 따른 집행여부",{"$nulls":6},2,null,{"$f":"P206","v":2}]
[null,"6-2. ② 연구지원비 집행계획 수립 및 동 수립계획에 따른 집행여부",{"$nulls":6},2,null,{"$f":"P223","v":1}]
[null,"6-2. ③ 성과활용지원비 집행계획 수립 및 동 수립계획에 따른 집행규모-1) 성과활용지원비 집행계획 수립",{"$nulls":6},1,null,{"$f":"P243","v":0}]
[null,"6-2. ③ 성과활용지원비 집행계획 수립 및 동 수립계획에 따른 집행규모-2) 수립계획에 따른 집행 규모",{"$nulls":6},1,null,{"$f":"P258","v":1}]
[null,"6-2. ④ 연구보안관리비의 간접비 지출 규모",{"$nulls":6},"+2",null,{"$f":"P273","v":1}]
[null,"6-2. ⑤ 연구실 안전관리비",{"$nulls":6},1,null,{"$f":"P295","v":1}]
[null,"6-2. 간접비 관리의 적절성",{"$nulls":6},"7(+2)",null,{"$f":"SUM(K299:L304)","v":6}]

{"sheet":"7.연구지원 서비스만족도 및 우수사례","index":8,"n_rows":64,"n_cols":19,"rows_kept":64,"cut":false,"hidden":false,"merged":[[47,1,47,7],[47,8,47,9],[47,10,47,11],[56,1,56,7],[56,8,56,9],[56,10,56,11],[49,2,49,11],[50,2,50,11],[51,2,51,11],[52,2,52,11],[53,2,53,11],[55,1,55,7],[55,8,55,9],[55,10,55,11],[44,1,45,7],[44,8,44,11],[45,8,45,9],[45,10,45,11],[46,1,46,7],[46,8,46,9],[46,10,46,11],[38,1,42,2],[38,3,38,4],[38,5,38,8],[38,10,38,11],[39,3,39,4],[39,5,39,8],[39,10,39,11],[40,3,40,4],[40,5,40,8],[40,10,40,11],[41,3,41,4],[41,5,41,8],[41,10,41,11],[42,3,42,4],[42,5,42,8],[42,10,42,11],[33,1,37,2],[33,3,33,4],[33,5,33,8],[33,10,33,11],[34,3,34,4],[34,5,34,8],[34,10,34,11],[35,3,35,4],[35,5,35,8],[35,10,35,11],[36,3,36,4],[36,5,36,8],[36,10,36,11],[37,3,37,4],[37,5,37,8],[37,10,37,11],[25,8,25,9],[25,10,25,11],[32,1,32,2],[32,3,32,4],[32,5,32,8],[32,10,32,11],[26,1,26,7],[26,8,26,9],[26,10,26,11],[25,1,25,7],[14,1,14,2],[14,3,14,11],[15,1,23,1],[15,3,15,11],[16,3,16,11],[17,3,17,11],[18,3,18,11],[19,3,19,11],[20,3,20,11],[21,3,21,11],[22,3,22,11],[23,3,23,11],[3,1,8,11],[10,1,10,2],[10,3,10,7],[10,8,10,11],[11,1,12,2],[11,3,12,7],[11,8,12,11]]}
[]
[null,"7-1. 연구지원 서비스 만족도 조사"]
[]
[null,"* 작성시 유의사항\n- 기관에 해당사항이 없는 경우, ① \"O/X\"를 선택하는 항목에는 \"X\"를 표시하고, ② \"O/X\"를 선택하지 않는 항목에는 \n  반드시 해당 셀을 \"빈 칸\"으로 유지함\n- 하기 템플릿에 대하여 행, 열의 삽입 또는 삭제하지 않음\n- 자체평가 셀에 있는 함수는 수정하지 않음"]
[]
[]
[]
[]
[]
[]
[null,"연도",null,"설문 응답자(명)",{"$nulls":4},"문항 평균 100점 환산 점수(점)"]
[null,"입력",null,"입력",{"$nulls":4},79]
[]
[]
[null,"점수",null,"평가지침",{"$nulls":11},0,0]
[null,"연구지원 서비스 만족도 조사결과","10점","평가기간 내의 문항 평균 만족도 수준이 100점 환산 기준 80점 이상인 경우 ",{"$nulls":11},10,3]
[null,null,"9점","평가기간 내의 문항 평균 만족도 수준이 100점 환산 기준 70점 이상 80점 미만인 경우 ",{"$nulls":11},20,4]
[null,null,"8점","평가기간 내의 문항 평균 만족도 수준이 100점 환산 기준 60점 이상 70점 미만인 경우 ",{"$nulls":11},30,5]
[null,null,"7점","평가기간 내의 문항 평균 만족도 수준이 100점 환산 기준 50점 이상 60점 미만인 경우 ",{"$nulls":11},40,6]
[null,null,"6점 ","평가기간 내의 문항 평균 만족도 수준이 100점 환산 기준 40점 이상 50점 미만인 경우 ",{"$nulls":11},50,7]
[null,null,"5점","평가기간 내의 문항 평균 만족도 수준이 100점 환산 기준 30점 이상 40점 미만인 경우 ",{"$nulls":11},60,8]
[null,null,"4점","평가기간 내의 문항 평균 만족도 수준이 100점 환산 기준 20점 이상 30점 미만인 경우",{"$nulls":11},70,9]
[null,null,"3점","평가기간 내의 문항 평균 만족도 수준이 100점 환산 기준 10점 이상 20점 미만인 경우",{"$nulls":11},80,10]
[null,null,"0점","평가기간 내의 문항 평균 만족도 수준이 100점 환산 기준 10점 미만인 경우"]
[]
[null,"세부평가지표",{"$nulls":6},"배점",null,"자체평가"]
[null,"7-1. 연구지원 서비스 만족도 조사",{"$nulls":6},10,null,{"$f":"VLOOKUP(I12,$P$15:$Q$23,2,1)","v":9}]
[]
[]
[]
[null,"7-2. 연구지원을 위한 상시적인 모니터링에 따른 조치 우수사례"]
[]
[null,"구분(대분류)",null,"조치사항구분",null,"주요 조치내용",null,null,null,"조치일자","증빙서류"]
[null,"현장 애로사항 청취 ",null,"예)제도개선",null,"입력",null,null,null,"입력","입력"]
[null,null,null,"예)시스템 변경"]
[null,null,null,"예)지원금 지급"]
[null,null,null,"예)안전한 \n연구환경 조성"]
[null,null,null,"예) 기타"]
[null,"우수사례 활용 및 확산",null,"예)제도개선"]
[null,null,null,"예)시스템 변경"]
[null,null,null,"예)지원금 지급"]
[null,null,null,"예)안전한 연구환경 조성(안전관리 \n우수연구실 \n인증 취득 등)"]
[null,null,null,"예) 기타(홍보 등)"]
[]
[null,"평가항목",{"$nulls":6},"해당 여부(O/X)"]
[{"$nulls":8},"우수사례 기재됨",null,"우수사례 인정됨",null,"검증식"]
[null,"현장 애로사항 청취 대분류",{"$nulls":6},"O",null,"O",null,{"$f":"IF(I47=\"X\",IF(K47=\"O\",\"False\",\"\"),\"\")","v":""},null,null,"O"]
[null,"우수사례 활용 및 확산 대분류",{"$nulls":6},"O",null,"O",null,{"$f":"IF(I48=\"X\",IF(K48=\"O\",\"False\",\"\"),\"\")","v":""},null,null,"X"]
[]
[null,"점수","평가지침",{"$nulls":12},"집계",null,"점수기준"]
[null,"6점","2개 구분(대분류)별 우수사례가 모두 기재되고 모두 인정된 경우",{"$nulls":12},{"$f":"I47&I48&K47&K48","v":"OOOO"},null,"OOOO",6]
[null,"4점","2개 구분(대분류)별 우수사례가 기재되고 한 가지만 인정된 경우",{"$nulls":14},"OOXO",4]
[null,"2점","1개 구분별 우수사례가 기재되고 1개가 인정된 경우",{"$nulls":14},"OOOX",4]
[null,"0점","한가지도 우수사례로 인정 안된 경우",{"$nulls":14},"OXOX",2]
[{"$nulls":17},"XOXO",2]
[null,"세부평가지표",{"$nulls":6},"배점",null,"자체평가",{"$nulls":6},"OOXX",0]
[null,"7-2. 연구지원을 위한 상시적인 모니터링에 따른 조치 우수사례",{"$nulls":6},6,null,{"$f":"IFERROR(VLOOKUP(P51,R51:S64,2,0),0)","v":6},{"$nulls":6},"OXXX",0]
[{"$nulls":17},"XOXX",0]
[{"$nulls":17},"OXOO",2]
[{"$nulls":17},"XXOO",0]
[{"$nulls":17},"XOOO",2]
[{"$nulls":17},"XXOX",0]
[{"$nulls":17},"XXXO",0]
[{"$nulls":17},"XXXX",0]